{"text_format":"1","workbook":"xlsx","n_sheets":19,"sheets":["S1","S2","S3","S4","S5","S6","S7","S8","S9","S10","Chart 1-24","Chart 25-48","Chart 49-72","Chart 73-96","Chart 97-120","ST1","Avg","S13","AP"],"not_rendered":{"charts":20,"images":28,"macros":1,"external_links":0,"defined_names":0,"comments":0,"pivot_tables":0},"unopened":[],"bounds":{"document_bytes":16777216,"sheet_cells":100000,"rows_first":2000,"rows_last":500,"rows_between":2000,"halvings":0,"cell_chars":16384,"cell_head_chars":4096},"cells_cut":0,"cells_raw":0,"read":"whole","date_system":"1900"}

{"sheet":"S1","index":0,"n_rows":42,"n_cols":19,"rows_kept":42,"cut":false,"hidden":false,"merged":[[0,0,3,1],[7,0,7,1],[4,0,4,1],[23,8,23,9],[23,10,23,11],[18,0,21,1],[18,2,21,3],[18,4,21,5],[18,6,21,7],[17,0,17,1],[17,2,17,3],[17,4,17,5],[17,6,17,7],[8,10,8,11],[7,2,7,3],[7,4,7,5],[23,12,23,13],[17,8,17,9],[17,10,17,11],[17,12,17,13],[18,8,21,9],[18,12,21,13],[18,10,21,11],[34,0,37,1],[34,2,37,3],[34,4,37,5],[34,6,37,7],[33,10,33,11],[33,0,33,1],[33,2,33,3],[33,4,33,5],[33,6,33,7],[33,12,33,13],[34,8,37,9],[34,10,37,11],[34,12,37,13],[33,8,33,9],[24,10,24,11],[24,12,24,13],[25,0,25,1],[24,0,24,1],[24,8,24,9],[24,2,24,3],[24,4,24,5],[24,6,24,7],[26,0,26,1],[23,0,23,1],[23,2,23,3],[23,4,23,5],[23,6,23,7],[8,12,8,13],[9,0,9,1],[10,0,10,1],[8,8,8,9],[8,0,8,1],[8,2,8,3],[8,4,8,5],[8,6,8,7],[7,6,7,7],[7,10,7,11],[7,12,7,13],[7,8,7,9],[1,9,1,10],[2,9,2,10],[3,9,3,10],[1,2,1,6],[5,3,5,8],[3,2,3,6],[2,2,2,6],[0,7,3,8],[1,11,1,12],[2,11,2,12],[3,11,3,12]]}
[]
[null,null,"COMMONWEALTH OF PENNSYLVANIA",null,null,null,null,null,null,"DISTRICT",null,null,null,null,null,null,null,null,"Type 2"]
[null,null,"DEPARTMENT OF TRANSPORTATION",null,null,null,null,null,null,"PLANT CODE",null,null,null,null,null,null,null,null,"Type 3"]
[null,null,"PENNSYLVANIA TURNPIKE COMMISSION",null,null,null,null,null,null,"AGG SIZE",null,"Type 2",null,null,null,null,null,null,"Type 3A"]
["Aggregate 2023",null,null,null,null,null,null,null,null,null,null,null,null,null,null,null,null,null,"Type 4"]
[null,null,null,"Material Test Results for Type 2 Anti-Skid"]
[]
["Sample No."]
["Date"]
["Starting Weight",null,null,"% Loss",null,"% Loss",null,"% Loss",null,"% Loss",null,"% Loss",null,"% Loss"]
["Ending Weight",null,null,{"$f":"IF(ISBLANK(C10),\" \",IF(ISBLANK(C11),\" \",(C10-C11)/C10*100))","v":" "},null,{"$f":"IF(ISBLANK(E10),\" \",IF(ISBLANK(E11),\" \",(E10-E11)/E10*100))","v":" "},null,{"$f":"IF(ISBLANK(G10),\" \",IF(ISBLANK(G11),\" \",(G10-G11)/G10*100))","v":" "},null,{"$f":"IF(ISBLANK(I10),\" \",IF(ISBLANK(I11),\" \",(I10-I11)/I10*100))","v":" "},null,{"$f":"IF(ISBLANK(K10),\" \",IF(ISBLANK(K11),\" \",(K10-K11)/K10*100))","v":" "},null,{"$f":"IF(ISBLANK(M10),\" \",IF(ISBLANK(M11),\" \",(M10-M11)/M10*100))","v":" "}]
["Spec","Sieve","Wt","% Passing","Wt","% Passing","Wt","% Passing","Wt","% Passing","Wt","% Passing","Wt","% Passing"]
["100",0.5,null,{"$f":"IF(ISBLANK(C$10),\"  \",IF(ISBLANK(C$11),\" \",IF(ISBLANK(C13),\" \",ROUND((C13)/C$10*100,1))))","v":"  "},null,{"$f":"IF(ISBLANK(E$10),\"  \",IF(ISBLANK(E$11),\" \",IF(ISBLANK(E13),\" \",ROUND((E13)/E$10*100,1))))","v":"  "},null,{"$f":"IF(ISBLANK(G$10),\"  \",IF(ISBLANK(G$11),\" \",IF(ISBLANK(G13),\" \",ROUND((G13)/G$10*100,1))))","v":"  "},null,{"$f":"IF(ISBLANK(I$10),\"  \",IF(ISBLANK(I$11),\" \",IF(ISBLANK(I13),\" \",ROUND((I13)/I$10*100,1))))","v":"  "},null,{"$f":"IF(ISBLANK(K$10),\"  \",IF(ISBLANK(K$11),\" \",IF(ISBLANK(K13),\" \",ROUND((K13)/K$10*100,1))))","v":"  "},null,{"$f":"IF(ISBLANK(M$10),\"  \",IF(ISBLANK(M$11),\" \",IF(ISBLANK(M13),\" \",ROUND((M13)/M$10*100,1))))","v":"  "}]
["95-100",0.375,null,{"$f":"IF(ISBLANK(C$10),\"  \",IF(ISBLANK(C$11),\" \",IF(ISBLANK(C14),\" \",ROUND((C14)/C$10*100,0))))","v":"  "},null,{"$f":"IF(ISBLANK(E$10),\"  \",IF(ISBLANK(E$11),\" \",IF(ISBLANK(E14),\" \",ROUND((E14)/E$10*100,0))))","v":"  "},null,{"$f":"IF(ISBLANK(G$10),\"  \",IF(ISBLANK(G$11),\" \",IF(ISBLANK(G14),\" \",ROUND((G14)/G$10*100,0))))","v":"  "},null,{"$f":"IF(ISBLANK(I$10),\"  \",IF(ISBLANK(I$11),\" \",IF(ISBLANK(I14),\" \",ROUND((I14)/I$10*100,0))))","v":"  "},null,{"$f":"IF(ISBLANK(K$10),\"  \",IF(ISBLANK(K$11),\" \",IF(ISBLANK(K14),\" \",ROUND((K14)/K$10*100,0))))","v":"  "},null,{"$f":"IF(ISBLANK(M$10),\"  \",IF(ISBLANK(M$11),\" \",IF(ISBLANK(M14),\" \",ROUND((M14)/M$10*100,0))))","v":"  "}]
["Breaker",4,null,{"$f":"IF(ISBLANK(C$10),\"  \",IF(ISBLANK(C$11),\" \",IF(ISBLANK(C15),\" \",ROUND((C15)/C$10*100,0))))","v":"  "},null,{"$f":"IF(ISBLANK(E$10),\"  \",IF(ISBLANK(E$11),\" \",IF(ISBLANK(E15),\" \",ROUND((E15)/E$10*100,0))))","v":"  "},null,{"$f":"IF(ISBLANK(G$10),\"  \",IF(ISBLANK(G$11),\" \",IF(ISBLANK(G15),\" \",ROUND((G15)/G$10*100,0))))","v":"  "},null,{"$f":"IF(ISBLANK(I$10),\"  \",IF(ISBLANK(I$11),\" \",IF(ISBLANK(I15),\" \",ROUND((I15)/I$10*100,0))))","v":"  "},null,{"$f":"IF(ISBLANK(K$10),\"  \",IF(ISBLANK(K$11),\" \",IF(ISBLANK(K15),\" \",ROUND((K15)/K$10*100,0))))","v":"  "},null,{"$f":"IF(ISBLANK(M$10),\"  \",IF(ISBLANK(M$11),\" \",IF(ISBLANK(M15),\" \",ROUND((M15)/M$10*100,0))))","v":"  "}]
["0-30",8,null,{"$f":"IF(ISBLANK(C$10),\"  \",IF(ISBLANK(C$11),\" \",IF(ISBLANK(C16),\" \",ROUND((C16)/C$10*100,0))))","v":"  "},null,{"$f":"IF(ISBLANK(E$10),\"  \",IF(ISBLANK(E$11),\" \",IF(ISBLANK(E16),\" \",ROUND((E16)/E$10*100,0))))","v":"  "},null,{"$f":"IF(ISBLANK(G$10),\"  \",IF(ISBLANK(G$11),\" \",IF(ISBLANK(G16),\" \",ROUND((G16)/G$10*100,0))))","v":"  "},null,{"$f":"IF(ISBLANK(I$10),\"  \",IF(ISBLANK(I$11),\" \",IF(ISBLANK(I16),\" \",ROUND((I16)/I$10*100,0))))","v":"  "},null,{"$f":"IF(ISBLANK(K$10),\"  \",IF(ISBLANK(K$11),\" \",IF(ISBLANK(K16),\" \",ROUND((K16)/K$10*100,0))))","v":"  "},null,{"$f":"IF(ISBLANK(M$10),\"  \",IF(ISBLANK(M$11),\" \",IF(ISBLANK(M16),\" \",ROUND((M16)/M$10*100,0))))","v":"  "}]
["0-8",100,null,{"$f":"IF(ISBLANK(C$10),\"  \",IF(ISBLANK(C$11),\" \",IF(ISBLANK(C17),\" \",ROUND((C17)/C$10*100,0))))","v":"  "},null,{"$f":"IF(ISBLANK(E$10),\"  \",IF(ISBLANK(E$11),\" \",IF(ISBLANK(E17),\" \",ROUND((E17)/E$10*100,0))))","v":"  "},null,{"$f":"IF(ISBLANK(G$10),\"  \",IF(ISBLANK(G$11),\" \",IF(ISBLANK(G17),\" \",ROUND((G17)/G$10*100,0))))","v":"  "},null,{"$f":"IF(ISBLANK(I$10),\"  \",IF(ISBLANK(I$11),\" \",IF(ISBLANK(I17),\" \",ROUND((I17)/I$10*100,0))))","v":"  "},null,{"$f":"IF(ISBLANK(K$10),\"  \",IF(ISBLANK(K$11),\" \",IF(ISBLANK(K17),\" \",ROUND((K17)/K$10*100,0))))","v":"  "},null,{"$f":"IF(ISBLANK(M$10),\"  \",IF(ISBLANK(M$11),\" \",IF(ISBLANK(M17),\" \",ROUND((M17)/M$10*100,0))))","v":"  "}]
["Tested By"]
["Remarks"]
[]
[]
[]
[]
["Sample No."]
["Date"]
["Starting Weight",null,null,"% Loss",null,"% Loss",null,"% Loss",null,"% Loss",null,"% Loss",null,"% Loss"]
["Ending Weight",null,null,{"$f":"IF(ISBLANK(C26),\" \",IF(ISBLANK(C27),\" \",(C26-C27)/C26*100))","v":" "},null,{"$f":"IF(ISBLANK(E26),\" \",IF(ISBLANK(E27),\" \",(E26-E27)/E26*100))","v":" "},null,{"$f":"IF(ISBLANK(G26),\" \",IF(ISBLANK(G27),\" \",(G26-G27)/G26*100))","v":" "},null,{"$f":"IF(ISBLANK(I26),\" \",IF(ISBLANK(I27),\" \",(I26-I27)/I26*100))","v":" "},null,{"$f":"IF(ISBLANK(K26),\" \",IF(ISBLANK(K27),\" \",(K26-K27)/K26*100))","v":" "},null,{"$f":"IF(ISBLANK(M26),\" \",IF(ISBLANK(M27),\" \",(M26-M27)/M26*100))","v":" "}]
["Spec","Sieve","Wt","% Passing","Wt","% Passing","Wt","% Passing","Wt","% Passing","Wt","% Passing","Wt","% Passing"]
[{"$f":"A13","v":"100"},0.5,null,{"$f":"IF(ISBLANK(C$26),\"  \",IF(ISBLANK(C$27),\" \",IF(ISBLANK(C29),\" \",ROUND((C29)/C$26*100,1))))","v":"  "},null,{"$f":"IF(ISBLANK(E$26),\"  \",IF(ISBLANK(E$27),\" \",IF(ISBLANK(E29),\" \",ROUND((E29)/E$26*100,1))))","v":"  "},null,{"$f":"IF(ISBLANK(G$26),\"  \",IF(ISBLANK(G$27),\" \",IF(ISBLANK(G29),\" \",ROUND((G29)/G$26*100,1))))","v":"  "},null,{"$f":"IF(ISBLANK(I$26),\"  \",IF(ISBLANK(I$27),\" \",IF(ISBLANK(I29),\" \",ROUND((I29)/I$26*100,1))))","v":"  "},null,{"$f":"IF(ISBLANK(K$26),\"  \",IF(ISBLANK(K$27),\" \",IF(ISBLANK(K29),\" \",ROUND((K29)/K$26*100,1))))","v":"  "},null,{"$f":"IF(ISBLANK(M$26),\"  \",IF(ISBLANK(M$27),\" \",IF(ISBLANK(M29),\" \",ROUND((M29)/M$26*100,1))))","v":"  "}]
[{"$f":"A14","v":"95-100"},0.375,null,{"$f":"IF(ISBLANK(C$26),\"  \",IF(ISBLANK(C$27),\" \",IF(ISBLANK(C30),\" \",ROUND((C30)/C$26*100,0))))","v":"  "},null,{"$f":"IF(ISBLANK(E$26),\"  \",IF(ISBLANK(E$27),\" \",IF(ISBLANK(E30),\" \",ROUND((E30)/E$26*100,0))))","v":"  "},null,{"$f":"IF(ISBLANK(G$26),\"  \",IF(ISBLANK(G$27),\" \",IF(ISBLANK(G30),\" \",ROUND((G30)/G$26*100,0))))","v":"  "},null,{"$f":"IF(ISBLANK(I$26),\"  \",IF(ISBLANK(I$27),\" \",IF(ISBLANK(I30),\" \",ROUND((I30)/I$26*100,0))))","v":"  "},null,{"$f":"IF(ISBLANK(K$26),\"  \",IF(ISBLANK(K$27),\" \",IF(ISBLANK(K30),\" \",ROUND((K30)/K$26*100,0))))","v":"  "},null,{"$f":"IF(ISBLANK(M$26),\"  \",IF(ISBLANK(M$27),\" \",IF(ISBLANK(M30),\" \",ROUND((M30)/M$26*100,0))))","v":"  "}]
[{"$f":"A15","v":"Breaker"},4,null,{"$f":"IF(ISBLANK(C$26),\"  \",IF(ISBLANK(C$27),\" \",IF(ISBLANK(C31),\" \",ROUND((C31)/C$26*100,0))))","v":"  "},null,{"$f":"IF(ISBLANK(E$26),\"  \",IF(ISBLANK(E$27),\" \",IF(ISBLANK(E31),\" \",ROUND((E31)/E$26*100,0))))","v":"  "},null,{"$f":"IF(ISBLANK(G$26),\"  \",IF(ISBLANK(G$27),\" \",IF(ISBLANK(G31),\" \",ROUND((G31)/G$26*100,0))))","v":"  "},null,{"$f":"IF(ISBLANK(I$26),\"  \",IF(ISBLANK(I$27),\" \",IF(ISBLANK(I31),\" \",ROUND((I31)/I$26*100,0))))","v":"  "},null,{"$f":"IF(ISBLANK(K$26),\"  \",IF(ISBLANK(K$27),\" \",IF(ISBLANK(K31),\" \",ROUND((K31)/K$26*100,0))))","v":"  "},null,{"$f":"IF(ISBLANK(M$26),\"  \",IF(ISBLANK(M$27),\" \",IF(ISBLANK(M31),\" \",ROUND((M31)/M$26*100,0))))","v":"  "}]
[{"$f":"A16","v":"0-30"},8,null,{"$f":"IF(ISBLANK(C$26),\"  \",IF(ISBLANK(C$27),\" \",IF(ISBLANK(C32),\" \",ROUND((C32)/C$26*100,0))))","v":"  "},null,{"$f":"IF(ISBLANK(E$26),\"  \",IF(ISBLANK(E$27),\" \",IF(ISBLANK(E32),\" \",ROUND((E32)/E$26*100,0))))","v":"  "},null,{"$f":"IF(ISBLANK(G$26),\"  \",IF(ISBLANK(G$27),\" \",IF(ISBLANK(G32),\" \",ROUND((G32)/G$26*100,0))))","v":"  "},null,{"$f":"IF(ISBLANK(I$26),\"  \",IF(ISBLANK(I$27),\" \",IF(ISBLANK(I32),\" \",ROUND((I32)/I$26*100,0))))","v":"  "},null,{"$f":"IF(ISBLANK(K$26),\"  \",IF(ISBLANK(K$27),\" \",IF(ISBLANK(K32),\" \",ROUND((K32)/K$26*100,0))))","v":"  "},null,{"$f":"IF(ISBLANK(M$26),\"  \",IF(ISBLANK(M$27),\" \",IF(ISBLANK(M32),\" \",ROUND((M32)/M$26*100,0))))","v":"  "}]
[{"$f":"A17","v":"0-8"},100,null,{"$f":"IF(ISBLANK(C$26),\"  \",IF(ISBLANK(C$27),\" \",IF(ISBLANK(C33),\" \",ROUND((C33)/C$26*100,0))))","v":"  "},null,{"$f":"IF(ISBLANK(E$26),\"  \",IF(ISBLANK(E$27),\" \",IF(ISBLANK(E33),\" \",ROUND((E33)/E$26*100,0))))","v":"  "},null,{"$f":"IF(ISBLANK(G$26),\"  \",IF(ISBLANK(G$27),\" \",IF(ISBLANK(G33),\" \",ROUND((G33)/G$26*100,0))))","v":"  "},null,{"$f":"IF(ISBLANK(I$26),\"  \",IF(ISBLANK(I$27),\" \",IF(ISBLANK(I33),\" \",ROUND((I33)/I$26*100,0))))","v":"  "},null,{"$f":"IF(ISBLANK(K$26),\"  \",IF(ISBLANK(K$27),\" \",IF(ISBLANK(K33),\" \",ROUND((K33)/K$26*100,0))))","v":"  "},null,{"$f":"IF(ISBLANK(M$26),\"  \",IF(ISBLANK(M$27),\" \",IF(ISBLANK(M33),\" \",ROUND((M33)/M$26*100,0))))","v":"  "}]
["Tested By"]
["Remarks"]
[]
[]
[]
[]
[null,"B action","T action"]
[{"$f":"M6","v":0},{"$f":"A41-0.2","v":-0.2},{"$f":"A41+0.2","v":0.2}]
[null,{"$f":"A41-0.4","v":-0.4},{"$f":"A41+0.4","v":0.4}]

{"sheet":"S2","index":1,"n_rows":35,"n_cols":14,"rows_kept":35,"cut":false,"hidden":true,"merged":[[33,8,33,9],[33,10,33,11],[33,12,33,13],[34,0,37,1],[34,2,37,3],[34,4,37,5],[34,6,37,7],[34,8,37,9],[34,10,37,11],[34,12,37,13],[33,0,33,1],[33,2,33,3],[33,4,33,5],[33,6,33,7],[0,8,3,9],[18,6,21,7],[18,8,21,9],[18,10,21,11],[18,12,21,13],[1,12,1,13],[2,10,2,11],[2,12,2,13],[3,10,3,11],[3,12,3,13],[17,6,17,7],[17,10,17,11],[17,8,17,9],[1,10,1,11],[5,3,5,8],[7,8,7,9],[0,0,3,1],[7,0,7,1],[7,2,7,3],[7,4,7,5],[7,6,7,7],[4,0,4,1],[1,2,1,7],[2,2,2,7],[3,2,3,7],[9,0,9,1],[8,0,8,1],[8,2,8,3],[10,0,10,1],[7,12,7,13],[8,4,8,5],[8,6,8,7],[8,10,8,11],[8,12,8,13],[8,8,8,9],[7,10,7,11],[26,0,26,1],[18,4,21,5],[24,4,24,5],[24,12,24,13],[24,10,24,11],[18,2,21,3],[24,8,24,9],[23,8,23,9],[24,6,24,7],[24,0,24,1],[24,2,24,3],[23,12,23,13],[23,0,23,1],[23,2,23,3],[23,4,23,5],[23,6,23,7],[17,12,17,13],[25,0,25,1],[17,2,17,3],[17,4,17,5],[17,0,17,1],[18,0,21,1],[23,10,23,11]]}
[]
[null,null,"COMMONWEALTH OF PENNSYLVANIA",null,null,null,null,null,null,null,"DISTRICT",null,{"$f":"IF(ISBLANK('S1'!L2),\" \",'S1'!L2)","v":" "}]
[null,null,"DEPARTMENT OF TRANSPORTATION",null,null,null,null,null,null,null,"PLANT CODE",null,{"$f":"IF(ISBLANK('S1'!L3),\" \",'S1'!L3)","v":" "}]
[null,null,"PENNSYLVANIA TURNPIKE COMMISSION",null,null,null,null,null,null,null,"AGG SIZE",null,{"$f":"IF(ISBLANK('S1'!L4),\" \",'S1'!L4)","v":"Type 2"}]
[{"$f":"'S1'!$A$5","v":"Aggregate 2023"}]
[null,null,null,{"$f":"'S1'!D6","v":"Material Test Results for Type 2 Anti-Skid"}]
[]
["Sample No."]
["Date"]
["Starting Weight",null,null,"% Loss",null,"% Loss",null,"% Loss",null,"% Loss",null,"% Loss",null,"% Loss"]
["Ending Weight",null,null,{"$f":"IF(ISBLANK(C10),\" \",IF(ISBLANK(C11),\" \",(C10-C11)/C10*100))","v":" "},null,{"$f":"IF(ISBLANK(E10),\" \",IF(ISBLANK(E11),\" \",(E10-E11)/E10*100))","v":" "},null,{"$f":"IF(ISBLANK(G10),\" \",IF(ISBLANK(G11),\" \",(G10-G11)/G10*100))","v":" "},null,{"$f":"IF(ISBLANK(I10),\" \",IF(ISBLANK(I11),\" \",(I10-I11)/I10*100))","v":" "},null,{"$f":"IF(ISBLANK(K10),\" \",IF(ISBLANK(K11),\" \",(K10-K11)/K10*100))","v":" "},null,{"$f":"IF(ISBLANK(M10),\" \",IF(ISBLANK(M11),\" \",(M10-M11)/M10*100))","v":" "}]
["Spec","Sieve","Wt","% Passing","Wt","% Passing","Wt","% Passing","Wt","% Passing","Wt","% Passing","Wt","% Passing"]
[{"$f":"'S1'!A13","v":"100"},{"$f":"'S1'!B13","v":0.5},null,{"$f":"IF(ISBLANK(C$10),\"  \",IF(ISBLANK(C$11),\" \",IF(ISBLANK(C13),\" \",ROUND((C13)/C$10*100,1))))","v":"  "},null,{"$f":"IF(ISBLANK(E$10),\"  \",IF(ISBLANK(E$11),\" \",IF(ISBLANK(E13),\" \",ROUND((E13)/E$10*100,1))))","v":"  "},null,{"$f":"IF(ISBLANK(G$10),\"  \",IF(ISBLANK(G$11),\" \",IF(ISBLANK(G13),\" \",ROUND((G13)/G$10*100,1))))","v":"  "},null,{"$f":"IF(ISBLANK(I$10),\"  \",IF(ISBLANK(I$11),\" \",IF(ISBLANK(I13),\" \",ROUND((I13)/I$10*100,1))))","v":"  "},null,{"$f":"IF(ISBLANK(K$10),\"  \",IF(ISBLANK(K$11),\" \",IF(ISBLANK(K13),\" \",ROUND((K13)/K$10*100,1))))","v":"  "},null,{"$f":"IF(ISBLANK(M$10),\"  \",IF(ISBLANK(M$11),\" \",IF(ISBLANK(M13),\" \",ROUND((M13)/M$10*100,1))))","v":"  "}]
[{"$f":"'S1'!A14","v":"95-100"},{"$f":"'S1'!B14","v":0.375},null,{"$f":"IF(ISBLANK(C$10),\"  \",IF(ISBLANK(C$11),\" \",IF(ISBLANK(C14),\" \",ROUND((C14)/C$10*100,0))))","v":"  "},null,{"$f":"IF(ISBLANK(E$10),\"  \",IF(ISBLANK(E$11),\" \",IF(ISBLANK(E14),\" \",ROUND((E14)/E$10*100,0))))","v":"  "},null,{"$f":"IF(ISBLANK(G$10),\"  \",IF(ISBLANK(G$11),\" \",IF(ISBLANK(G14),\" \",ROUND((G14)/G$10*100,0))))","v":"  "},null,{"$f":"IF(ISBLANK(I$10),\"  \",IF(ISBLANK(I$11),\" \",IF(ISBLANK(I14),\" \",ROUND((I14)/I$10*100,0))))","v":"  "},null,{"$f":"IF(ISBLANK(K$10),\"  \",IF(ISBLANK(K$11),\" \",IF(ISBLANK(K14),\" \",ROUND((K14)/K$10*100,0))))","v":"  "},null,{"$f":"IF(ISBLANK(M$10),\"  \",IF(ISBLANK(M$11),\" \",IF(ISBLANK(M14),\" \",ROUND((M14)/M$10*100,0))))","v":"  "}]
[{"$f":"'S1'!A15","v":"Breaker"},{"$f":"'S1'!B15","v":4},null,{"$f":"IF(ISBLANK(C$10),\"  \",IF(ISBLANK(C$11),\" \",IF(ISBLANK(C15),\" \",ROUND((C15)/C$10*100,0))))","v":"  "},null,{"$f":"IF(ISBLANK(E$10),\"  \",IF(ISBLANK(E$11),\" \",IF(ISBLANK(E15),\" \",ROUND((E15)/E$10*100,0))))","v":"  "},null,{"$f":"IF(ISBLANK(G$10),\"  \",IF(ISBLANK(G$11),\" \",IF(ISBLANK(G15),\" \",ROUND((G15)/G$10*100,0))))","v":"  "},null,{"$f":"IF(ISBLANK(I$10),\"  \",IF(ISBLANK(I$11),\" \",IF(ISBLANK(I15),\" \",ROUND((I15)/I$10*100,0))))","v":"  "},null,{"$f":"IF(ISBLANK(K$10),\"  \",IF(ISBLANK(K$11),\" \",IF(ISBLANK(K15),\" \",ROUND((K15)/K$10*100,0))))","v":"  "},null,{"$f":"IF(ISBLANK(M$10),\"  \",IF(ISBLANK(M$11),\" \",IF(ISBLANK(M15),\" \",ROUND((M15)/M$10*100,0))))","v":"  "}]
[{"$f":"'S1'!A16","v":"0-30"},{"$f":"'S1'!B16","v":8},null,{"$f":"IF(ISBLANK(C$10),\"  \",IF(ISBLANK(C$11),\" \",IF(ISBLANK(C16),\" \",ROUND((C16)/C$10*100,0))))","v":"  "},null,{"$f":"IF(ISBLANK(E$10),\"  \",IF(ISBLANK(E$11),\" \",IF(ISBLANK(E16),\" \",ROUND((E16)/E$10*100,0))))","v":"  "},null,{"$f":"IF(ISBLANK(G$10),\"  \",IF(ISBLANK(G$11),\" \",IF(ISBLANK(G16),\" \",ROUND((G16)/G$10*100,0))))","v":"  "},null,{"$f":"IF(ISBLANK(I$10),\"  \",IF(ISBLANK(I$11),\" \",IF(ISBLANK(I16),\" \",ROUND((I16)/I$10*100,0))))","v":"  "},null,{"$f":"IF(ISBLANK(K$10),\"  \",IF(ISBLANK(K$11),\" \",IF(ISBLANK(K16),\" \",ROUND((K16)/K$10*100,0))))","v":"  "},null,{"$f":"IF(ISBLANK(M$10),\"  \",IF(ISBLANK(M$11),\" \",IF(ISBLANK(M16),\" \",ROUND((M16)/M$10*100,0))))","v":"  "}]
[{"$f":"'S1'!A17","v":"0-8"},{"$f":"'S1'!B17","v":100},null,{"$f":"IF(ISBLANK(C$10),\"  \",IF(ISBLANK(C$11),\" \",IF(ISBLANK(C17),\" \",ROUND((C17)/C$10*100,0))))","v":"  "},null,{"$f":"IF(ISBLANK(E$10),\"  \",IF(ISBLANK(E$11),\" \",IF(ISBLANK(E17),\" \",ROUND((E17)/E$10*100,0))))","v":"  "},null,{"$f":"IF(ISBLANK(G$10),\"  \",IF(ISBLANK(G$11),\" \",IF(ISBLANK(G17),\" \",ROUND((G17)/G$10*100,0))))","v":"  "},null,{"$f":"IF(ISBLANK(I$10),\"  \",IF(ISBLANK(I$11),\" \",IF(ISBLANK(I17),\" \",ROUND((I17)/I$10*100,0))))","v":"  "},null,{"$f":"IF(ISBLANK(K$10),\"  \",IF(ISBLANK(K$11),\" \",IF(ISBLANK(K17),\" \",ROUND((K17)/K$10*100,0))))","v":"  "},null,{"$f":"IF(ISBLANK(M$10),\"  \",IF(ISBLANK(M$11),\" \",IF(ISBLANK(M17),\" \",ROUND((M17)/M$10*100,0))))","v":"  "}]
["Tested By"]
["Remarks"]
[]
[]
[]
[]
["Sample No."]
["Date"]
["Starting Weight",null,null,"% Loss",null,"% Loss",null,"% Loss",null,"% Loss",null,"% Loss",null,"% Loss"]
["Ending Weight",null,null,{"$f":"IF(ISBLANK(C26),\" \",IF(ISBLANK(C27),\" \",(C26-C27)/C26*100))","v":" "},null,{"$f":"IF(ISBLANK(E26),\" \",IF(ISBLANK(E27),\" \",(E26-E27)/E26*100))","v":" "},null,{"$f":"IF(ISBLANK(G26),\" \",IF(ISBLANK(G27),\" \",(G26-G27)/G26*100))","v":" "},null,{"$f":"IF(ISBLANK(I26),\" \",IF(ISBLANK(I27),\" \",(I26-I27)/I26*100))","v":" "},null,{"$f":"IF(ISBLANK(K26),\" \",IF(ISBLANK(K27),\" \",(K26-K27)/K26*100))","v":" "},null,{"$f":"IF(ISBLANK(M26),\" \",IF(ISBLANK(M27),\" \",(M26-M27)/M26*100))","v":" "}]
["Spec","Sieve","Wt","% Passing","Wt","% Passing","Wt","% Passing","Wt","% Passing","Wt","% Passing","Wt","% Passing"]
[{"$f":"'S1'!A29","v":"100"},{"$f":"'S1'!B29","v":0.5},null,{"$f":"IF(ISBLANK(C$26),\"  \",IF(ISBLANK(C$27),\" \",IF(ISBLANK(C29),\" \",ROUND((C29)/C$26*100,1))))","v":"  "},null,{"$f":"IF(ISBLANK(E$26),\"  \",IF(ISBLANK(E$27),\" \",IF(ISBLANK(E29),\" \",ROUND((E29)/E$26*100,1))))","v":"  "},null,{"$f":"IF(ISBLANK(G$26),\"  \",IF(ISBLANK(G$27),\" \",IF(ISBLANK(G29),\" \",ROUND((G29)/G$26*100,1))))","v":"  "},null,{"$f":"IF(ISBLANK(I$26),\"  \",IF(ISBLANK(I$27),\" \",IF(ISBLANK(I29),\" \",ROUND((I29)/I$26*100,1))))","v":"  "},null,{"$f":"IF(ISBLANK(K$26),\"  \",IF(ISBLANK(K$27),\" \",IF(ISBLANK(K29),\" \",ROUND((K29)/K$26*100,1))))","v":"  "},null,{"$f":"IF(ISBLANK(M$26),\"  \",IF(ISBLANK(M$27),\" \",IF(ISBLANK(M29),\" \",ROUND((M29)/M$26*100,1))))","v":"  "}]
[{"$f":"'S1'!A30","v":"95-100"},{"$f":"'S1'!B30","v":0.375},null,{"$f":"IF(ISBLANK(C$26),\"  \",IF(ISBLANK(C$27),\" \",IF(ISBLANK(C30),\" \",ROUND((C30)/C$26*100,0))))","v":"  "},null,{"$f":"IF(ISBLANK(E$26),\"  \",IF(ISBLANK(E$27),\" \",IF(ISBLANK(E30),\" \",ROUND((E30)/E$26*100,0))))","v":"  "},null,{"$f":"IF(ISBLANK(G$26),\"  \",IF(ISBLANK(G$27),\" \",IF(ISBLANK(G30),\" \",ROUND((G30)/G$26*100,0))))","v":"  "},null,{"$f":"IF(ISBLANK(I$26),\"  \",IF(ISBLANK(I$27),\" \",IF(ISBLANK(I30),\" \",ROUND((I30)/I$26*100,0))))","v":"  "},null,{"$f":"IF(ISBLANK(K$26),\"  \",IF(ISBLANK(K$27),\" \",IF(ISBLANK(K30),\" \",ROUND((K30)/K$26*100,0))))","v":"  "},null,{"$f":"IF(ISBLANK(M$26),\"  \",IF(ISBLANK(M$27),\" \",IF(ISBLANK(M30),\" \",ROUND((M30)/M$26*100,0))))","v":"  "}]
[{"$f":"'S1'!A31","v":"Breaker"},{"$f":"'S1'!B31","v":4},null,{"$f":"IF(ISBLANK(C$26),\"  \",IF(ISBLANK(C$27),\" \",IF(ISBLANK(C31),\" \",ROUND((C31)/C$26*100,0))))","v":"  "},null,{"$f":"IF(ISBLANK(E$26),\"  \",IF(ISBLANK(E$27),\" \",IF(ISBLANK(E31),\" \",ROUND((E31)/E$26*100,0))))","v":"  "},null,{"$f":"IF(ISBLANK(G$26),\"  \",IF(ISBLANK(G$27),\" \",IF(ISBLANK(G31),\" \",ROUND((G31)/G$26*100,0))))","v":"  "},null,{"$f":"IF(ISBLANK(I$26),\"  \",IF(ISBLANK(I$27),\" \",IF(ISBLANK(I31),\" \",ROUND((I31)/I$26*100,0))))","v":"  "},null,{"$f":"IF(ISBLANK(K$26),\"  \",IF(ISBLANK(K$27),\" \",IF(ISBLANK(K31),\" \",ROUND((K31)/K$26*100,0))))","v":"  "},null,{"$f":"IF(ISBLANK(M$26),\"  \",IF(ISBLANK(M$27),\" \",IF(ISBLANK(M31),\" \",ROUND((M31)/M$26*100,0))))","v":"  "}]
[{"$f":"'S1'!A32","v":"0-30"},{"$f":"'S1'!B32","v":8},null,{"$f":"IF(ISBLANK(C$26),\"  \",IF(ISBLANK(C$27),\" \",IF(ISBLANK(C32),\" \",ROUND((C32)/C$26*100,0))))","v":"  "},null,{"$f":"IF(ISBLANK(E$26),\"  \",IF(ISBLANK(E$27),\" \",IF(ISBLANK(E32),\" \",ROUND((E32)/E$26*100,0))))","v":"  "},null,{"$f":"IF(ISBLANK(G$26),\"  \",IF(ISBLANK(G$27),\" \",IF(ISBLANK(G32),\" \",ROUND((G32)/G$26*100,0))))","v":"  "},null,{"$f":"IF(ISBLANK(I$26),\"  \",IF(ISBLANK(I$27),\" \",IF(ISBLANK(I32),\" \",ROUND((I32)/I$26*100,0))))","v":"  "},null,{"$f":"IF(ISBLANK(K$26),\"  \",IF(ISBLANK(K$27),\" \",IF(ISBLANK(K32),\" \",ROUND((K32)/K$26*100,0))))","v":"  "},null,{"$f":"IF(ISBLANK(M$26),\"  \",IF(ISBLANK(M$27),\" \",IF(ISBLANK(M32),\" \",ROUND((M32)/M$26*100,0))))","v":"  "}]
[{"$f":"'S1'!A33","v":"0-8"},{"$f":"'S1'!B33","v":100},null,{"$f":"IF(ISBLANK(C$26),\"  \",IF(ISBLANK(C$27),\" \",IF(ISBLANK(C33),\" \",ROUND((C33)/C$26*100,0))))","v":"  "},null,{"$f":"IF(ISBLANK(E$26),\"  \",IF(ISBLANK(E$27),\" \",IF(ISBLANK(E33),\" \",ROUND((E33)/E$26*100,0))))","v":"  "},null,{"$f":"IF(ISBLANK(G$26),\"  \",IF(ISBLANK(G$27),\" \",IF(ISBLANK(G33),\" \",ROUND((G33)/G$26*100,0))))","v":"  "},null,{"$f":"IF(ISBLANK(I$26),\"  \",IF(ISBLANK(I$27),\" \",IF(ISBLANK(I33),\" \",ROUND((I33)/I$26*100,0))))","v":"  "},null,{"$f":"IF(ISBLANK(K$26),\"  \",IF(ISBLANK(K$27),\" \",IF(ISBLANK(K33),\" \",ROUND((K33)/K$26*100,0))))","v":"  "},null,{"$f":"IF(ISBLANK(M$26),\"  \",IF(ISBLANK(M$27),\" \",IF(ISBLANK(M33),\" \",ROUND((M33)/M$26*100,0))))","v":"  "}]
["Tested By"]
["Remarks"]

{"sheet":"S3","index":2,"n_rows":35,"n_cols":14,"rows_kept":35,"cut":false,"hidden":true,"merged":[[34,12,37,13],[10,0,10,1],[9,0,9,1],[7,10,7,11],[7,12,7,13],[8,0,8,1],[8,2,8,3],[8,4,8,5],[8,6,8,7],[8,8,8,9],[8,10,8,11],[8,12,8,13],[17,2,17,3],[17,4,17,5],[18,0,21,1],[18,2,21,3],[5,3,5,8],[7,0,7,1],[7,2,7,3],[7,4,7,5],[7,6,7,7],[7,8,7,9],[3,10,3,11],[3,12,3,13],[0,0,3,1],[1,10,1,11],[1,12,1,13],[2,10,2,11],[2,12,2,13],[0,8,3,9],[1,2,1,7],[2,2,2,7],[3,2,3,7],[17,6,17,7],[34,0,37,1],[34,2,37,3],[34,4,37,5],[18,4,21,5],[18,6,21,7],[34,6,37,7],[24,6,24,7],[33,2,33,3],[33,4,33,5],[17,0,17,1],[17,12,17,13],[23,12,23,13],[33,8,33,9],[33,10,33,11],[23,8,23,9],[23,10,23,11],[18,8,21,9],[18,10,21,11],[18,12,21,13],[24,8,24,9],[24,10,24,11],[24,12,24,13],[33,12,33,13],[34,8,37,9],[34,10,37,11],[17,8,17,9],[17,10,17,11],[4,0,4,1],[25,0,25,1],[33,0,33,1],[26,0,26,1],[33,6,33,7],[23,0,23,1],[23,2,23,3],[23,4,23,5],[23,6,23,7],[24,0,24,1],[24,2,24,3],[24,4,24,5]]}
[]
[null,null,"COMMONWEALTH OF PENNSYLVANIA",null,null,null,null,null,null,null,"DISTRICT",null,{"$f":"IF(ISBLANK('S1'!L2),\" \",'S1'!L2)","v":" "}]
[null,null,"DEPARTMENT OF TRANSPORTATION",null,null,null,null,null,null,null,"PLANT CODE",null,{"$f":"IF(ISBLANK('S1'!L3),\" \",'S1'!L3)","v":" "}]
[null,null,"PENNSYLVANIA TURNPIKE COMMISSION",null,null,null,null,null,null,null,"AGG SIZE",null,{"$f":"IF(ISBLANK('S1'!L4),\" \",'S1'!L4)","v":"Type 2"}]
[{"$f":"'S1'!$A$5","v":"Aggregate 2023"}]
[null,null,null,{"$f":"'S1'!D6","v":"Material Test Results for Type 2 Anti-Skid"}]
[]
["Sample No."]
["Date"]
["Starting Weight",null,null,"% Loss",null,"% Loss",null,"% Loss",null,"% Loss",null,"% Loss",null,"% Loss"]
["Ending Weight",null,null,{"$f":"IF(ISBLANK(C10),\" \",IF(ISBLANK(C11),\" \",(C10-C11)/C10*100))","v":" "},null,{"$f":"IF(ISBLANK(E10),\" \",IF(ISBLANK(E11),\" \",(E10-E11)/E10*100))","v":" "},null,{"$f":"IF(ISBLANK(G10),\" \",IF(ISBLANK(G11),\" \",(G10-G11)/G10*100))","v":" "},null,{"$f":"IF(ISBLANK(I10),\" \",IF(ISBLANK(I11),\" \",(I10-I11)/I10*100))","v":" "},null,{"$f":"IF(ISBLANK(K10),\" \",IF(ISBLANK(K11),\" \",(K10-K11)/K10*100))","v":" "},null,{"$f":"IF(ISBLANK(M10),\" \",IF(ISBLANK(M11),\" \",(M10-M11)/M10*100))","v":" "}]
["Spec","Sieve","Wt","% Passing","Wt","% Passing","Wt","% Passing","Wt","% Passing","Wt","% Passing","Wt","% Passing"]
[{"$f":"'S1'!A13","v":"100"},{"$f":"'S1'!B13","v":0.5},null,{"$f":"IF(ISBLANK(C$10),\"  \",IF(ISBLANK(C$11),\" \",IF(ISBLANK(C13),\" \",ROUND((C13)/C$10*100,1))))","v":"  "},null,{"$f":"IF(ISBLANK(E$10),\"  \",IF(ISBLANK(E$11),\" \",IF(ISBLANK(E13),\" \",ROUND((E13)/E$10*100,1))))","v":"  "},null,{"$f":"IF(ISBLANK(G$10),\"  \",IF(ISBLANK(G$11),\" \",IF(ISBLANK(G13),\" \",ROUND((G13)/G$10*100,1))))","v":"  "},null,{"$f":"IF(ISBLANK(I$10),\"  \",IF(ISBLANK(I$11),\" \",IF(ISBLANK(I13),\" \",ROUND((I13)/I$10*100,1))))","v":"  "},null,{"$f":"IF(ISBLANK(K$10),\"  \",IF(ISBLANK(K$11),\" \",IF(ISBLANK(K13),\" \",ROUND((K13)/K$10*100,1))))","v":"  "},null,{"$f":"IF(ISBLANK(M$10),\"  \",IF(ISBLANK(M$11),\" \",IF(ISBLANK(M13),\" \",ROUND((M13)/M$10*100,1))))","v":"  "}]
[{"$f":"'S1'!A14","v":"95-100"},{"$f":"'S1'!B14","v":0.375},null,{"$f":"IF(ISBLANK(C$10),\"  \",IF(ISBLANK(C$11),\" \",IF(ISBLANK(C14),\" \",ROUND((C14)/C$10*100,0))))","v":"  "},null,{"$f":"IF(ISBLANK(E$10),\"  \",IF(ISBLANK(E$11),\" \",IF(ISBLANK(E14),\" \",ROUND((E14)/E$10*100,0))))","v":"  "},null,{"$f":"IF(ISBLANK(G$10),\"  \",IF(ISBLANK(G$11),\" \",IF(ISBLANK(G14),\" \",ROUND((G14)/G$10*100,0))))","v":"  "},null,{"$f":"IF(ISBLANK(I$10),\"  \",IF(ISBLANK(I$11),\" \",IF(ISBLANK(I14),\" \",ROUND((I14)/I$10*100,0))))","v":"  "},null,{"$f":"IF(ISBLANK(K$10),\"  \",IF(ISBLANK(K$11),\" \",IF(ISBLANK(K14),\" \",ROUND((K14)/K$10*100,0))))","v":"  "},null,{"$f":"IF(ISBLANK(M$10),\"  \",IF(ISBLANK(M$11),\" \",IF(ISBLANK(M14),\" \",ROUND((M14)/M$10*100,0))))","v":"  "}]
[{"$f":"'S1'!A15","v":"Breaker"},{"$f":"'S1'!B15","v":4},null,{"$f":"IF(ISBLANK(C$10),\"  \",IF(ISBLANK(C$11),\" \",IF(ISBLANK(C15),\" \",ROUND((C15)/C$10*100,0))))","v":"  "},null,{"$f":"IF(ISBLANK(E$10),\"  \",IF(ISBLANK(E$11),\" \",IF(ISBLANK(E15),\" \",ROUND((E15)/E$10*100,0))))","v":"  "},null,{"$f":"IF(ISBLANK(G$10),\"  \",IF(ISBLANK(G$11),\" \",IF(ISBLANK(G15),\" \",ROUND((G15)/G$10*100,0))))","v":"  "},null,{"$f":"IF(ISBLANK(I$10),\"  \",IF(ISBLANK(I$11),\" \",IF(ISBLANK(I15),\" \",ROUND((I15)/I$10*100,0))))","v":"  "},null,{"$f":"IF(ISBLANK(K$10),\"  \",IF(ISBLANK(K$11),\" \",IF(ISBLANK(K15),\" \",ROUND((K15)/K$10*100,0))))","v":"  "},null,{"$f":"IF(ISBLANK(M$10),\"  \",IF(ISBLANK(M$11),\" \",IF(ISBLANK(M15),\" \",ROUND((M15)/M$10*100,0))))","v":"  "}]
[{"$f":"'S1'!A16","v":"0-30"},{"$f":"'S1'!B16","v":8},null,{"$f":"IF(ISBLANK(C$10),\"  \",IF(ISBLANK(C$11),\" \",IF(ISBLANK(C16),\" \",ROUND((C16)/C$10*100,0))))","v":"  "},null,{"$f":"IF(ISBLANK(E$10),\"  \",IF(ISBLANK(E$11),\" \",IF(ISBLANK(E16),\" \",ROUND((E16)/E$10*100,0))))","v":"  "},null,{"$f":"IF(ISBLANK(G$10),\"  \",IF(ISBLANK(G$11),\" \",IF(ISBLANK(G16),\" \",ROUND((G16)/G$10*100,0))))","v":"  "},null,{"$f":"IF(ISBLANK(I$10),\"  \",IF(ISBLANK(I$11),\" \",IF(ISBLANK(I16),\" \",ROUND((I16)/I$10*100,0))))","v":"  "},null,{"$f":"IF(ISBLANK(K$10),\"  \",IF(ISBLANK(K$11),\" \",IF(ISBLANK(K16),\" \",ROUND((K16)/K$10*100,0))))","v":"  "},null,{"$f":"IF(ISBLANK(M$10),\"  \",IF(ISBLANK(M$11),\" \",IF(ISBLANK(M16),\" \",ROUND((M16)/M$10*100,0))))","v":"  "}]
[{"$f":"'S1'!A17","v":"0-8"},{"$f":"'S1'!B17","v":100},null,{"$f":"IF(ISBLANK(C$10),\"  \",IF(ISBLANK(C$11),\" \",IF(ISBLANK(C17),\" \",ROUND((C17)/C$10*100,0))))","v":"  "},null,{"$f":"IF(ISBLANK(E$10),\"  \",IF(ISBLANK(E$11),\" \",IF(ISBLANK(E17),\" \",ROUND((E17)/E$10*100,0))))","v":"  "},null,{"$f":"IF(ISBLANK(G$10),\"  \",IF(ISBLANK(G$11),\" \",IF(ISBLANK(G17),\" \",ROUND((G17)/G$10*100,0))))","v":"  "},null,{"$f":"IF(ISBLANK(I$10),\"  \",IF(ISBLANK(I$11),\" \",IF(ISBLANK(I17),\" \",ROUND((I17)/I$10*100,0))))","v":"  "},null,{"$f":"IF(ISBLANK(K$10),\"  \",IF(ISBLANK(K$11),\" \",IF(ISBLANK(K17),\" \",ROUND((K17)/K$10*100,0))))","v":"  "},null,{"$f":"IF(ISBLANK(M$10),\"  \",IF(ISBLANK(M$11),\" \",IF(ISBLANK(M17),\" \",ROUND((M17)/M$10*100,0))))","v":"  "}]
["Tested By"]
["Remarks"]
[]
[]
[]
[]
["Sample No."]
["Date"]
["Starting Weight",null,null,"% Loss",null,"% Loss",null,"% Loss",null,"% Loss",null,"% Loss",null,"% Loss"]
["Ending Weight",null,null,{"$f":"IF(ISBLANK(C26),\" \",IF(ISBLANK(C27),\" \",(C26-C27)/C26*100))","v":" "},null,{"$f":"IF(ISBLANK(E26),\" \",IF(ISBLANK(E27),\" \",(E26-E27)/E26*100))","v":" "},null,{"$f":"IF(ISBLANK(G26),\" \",IF(ISBLANK(G27),\" \",(G26-G27)/G26*100))","v":" "},null,{"$f":"IF(ISBLANK(I26),\" \",IF(ISBLANK(I27),\" \",(I26-I27)/I26*100))","v":" "},null,{"$f":"IF(ISBLANK(K26),\" \",IF(ISBLANK(K27),\" \",(K26-K27)/K26*100))","v":" "},null,{"$f":"IF(ISBLANK(M26),\" \",IF(ISBLANK(M27),\" \",(M26-M27)/M26*100))","v":" "}]
["Spec","Sieve","Wt","% Passing","Wt","% Passing","Wt","% Passing","Wt","% Passing","Wt","% Passing","Wt","% Passing"]
[{"$f":"'S1'!A29","v":"100"},{"$f":"'S1'!B29","v":0.5},null,{"$f":"IF(ISBLANK(C$26),\"  \",IF(ISBLANK(C$27),\" \",IF(ISBLANK(C29),\" \",ROUND((C29)/C$26*100,1))))","v":"  "},null,{"$f":"IF(ISBLANK(E$26),\"  \",IF(ISBLANK(E$27),\" \",IF(ISBLANK(E29),\" \",ROUND((E29)/E$26*100,1))))","v":"  "},null,{"$f":"IF(ISBLANK(G$26),\"  \",IF(ISBLANK(G$27),\" \",IF(ISBLANK(G29),\" \",ROUND((G29)/G$26*100,1))))","v":"  "},null,{"$f":"IF(ISBLANK(I$26),\"  \",IF(ISBLANK(I$27),\" \",IF(ISBLANK(I29),\" \",ROUND((I29)/I$26*100,1))))","v":"  "},null,{"$f":"IF(ISBLANK(K$26),\"  \",IF(ISBLANK(K$27),\" \",IF(ISBLANK(K29),\" \",ROUND((K29)/K$26*100,1))))","v":"  "},null,{"$f":"IF(ISBLANK(M$26),\"  \",IF(ISBLANK(M$27),\" \",IF(ISBLANK(M29),\" \",ROUND((M29)/M$26*100,1))))","v":"  "}]
[{"$f":"'S1'!A30","v":"95-100"},{"$f":"'S1'!B30","v":0.375},null,{"$f":"IF(ISBLANK(C$26),\"  \",IF(ISBLANK(C$27),\" \",IF(ISBLANK(C30),\" \",ROUND((C30)/C$26*100,0))))","v":"  "},null,{"$f":"IF(ISBLANK(E$26),\"  \",IF(ISBLANK(E$27),\" \",IF(ISBLANK(E30),\" \",ROUND((E30)/E$26*100,0))))","v":"  "},null,{"$f":"IF(ISBLANK(G$26),\"  \",IF(ISBLANK(G$27),\" \",IF(ISBLANK(G30),\" \",ROUND((G30)/G$26*100,0))))","v":"  "},null,{"$f":"IF(ISBLANK(I$26),\"  \",IF(ISBLANK(I$27),\" \",IF(ISBLANK(I30),\" \",ROUND((I30)/I$26*100,0))))","v":"  "},null,{"$f":"IF(ISBLANK(K$26),\"  \",IF(ISBLANK(K$27),\" \",IF(ISBLANK(K30),\" \",ROUND((K30)/K$26*100,0))))","v":"  "},null,{"$f":"IF(ISBLANK(M$26),\"  \",IF(ISBLANK(M$27),\" \",IF(ISBLANK(M30),\" \",ROUND((M30)/M$26*100,0))))","v":"  "}]
[{"$f":"'S1'!A31","v":"Breaker"},{"$f":"'S1'!B31","v":4},null,{"$f":"IF(ISBLANK(C$26),\"  \",IF(ISBLANK(C$27),\" \",IF(ISBLANK(C31),\" \",ROUND((C31)/C$26*100,0))))","v":"  "},null,{"$f":"IF(ISBLANK(E$26),\"  \",IF(ISBLANK(E$27),\" \",IF(ISBLANK(E31),\" \",ROUND((E31)/E$26*100,0))))","v":"  "},null,{"$f":"IF(ISBLANK(G$26),\"  \",IF(ISBLANK(G$27),\" \",IF(ISBLANK(G31),\" \",ROUND((G31)/G$26*100,0))))","v":"  "},null,{"$f":"IF(ISBLANK(I$26),\"  \",IF(ISBLANK(I$27),\" \",IF(ISBLANK(I31),\" \",ROUND((I31)/I$26*100,0))))","v":"  "},null,{"$f":"IF(ISBLANK(K$26),\"  \",IF(ISBLANK(K$27),\" \",IF(ISBLANK(K31),\" \",ROUND((K31)/K$26*100,0))))","v":"  "},null,{"$f":"IF(ISBLANK(M$26),\"  \",IF(ISBLANK(M$27),\" \",IF(ISBLANK(M31),\" \",ROUND((M31)/M$26*100,0))))","v":"  "}]
[{"$f":"'S1'!A32","v":"0-30"},{"$f":"'S1'!B32","v":8},null,{"$f":"IF(ISBLANK(C$26),\"  \",IF(ISBLANK(C$27),\" \",IF(ISBLANK(C32),\" \",ROUND((C32)/C$26*100,0))))","v":"  "},null,{"$f":"IF(ISBLANK(E$26),\"  \",IF(ISBLANK(E$27),\" \",IF(ISBLANK(E32),\" \",ROUND((E32)/E$26*100,0))))","v":"  "},null,{"$f":"IF(ISBLANK(G$26),\"  \",IF(ISBLANK(G$27),\" \",IF(ISBLANK(G32),\" \",ROUND((G32)/G$26*100,0))))","v":"  "},null,{"$f":"IF(ISBLANK(I$26),\"  \",IF(ISBLANK(I$27),\" \",IF(ISBLANK(I32),\" \",ROUND((I32)/I$26*100,0))))","v":"  "},null,{"$f":"IF(ISBLANK(K$26),\"  \",IF(ISBLANK(K$27),\" \",IF(ISBLANK(K32),\" \",ROUND((K32)/K$26*100,0))))","v":"  "},null,{"$f":"IF(ISBLANK(M$26),\"  \",IF(ISBLANK(M$27),\" \",IF(ISBLANK(M32),\" \",ROUND((M32)/M$26*100,0))))","v":"  "}]
[{"$f":"'S1'!A33","v":"0-8"},{"$f":"'S1'!B33","v":100},null,{"$f":"IF(ISBLANK(C$26),\"  \",IF(ISBLANK(C$27),\" \",IF(ISBLANK(C33),\" \",ROUND((C33)/C$26*100,0))))","v":"  "},null,{"$f":"IF(ISBLANK(E$26),\"  \",IF(ISBLANK(E$27),\" \",IF(ISBLANK(E33),\" \",ROUND((E33)/E$26*100,0))))","v":"  "},null,{"$f":"IF(ISBLANK(G$26),\"  \",IF(ISBLANK(G$27),\" \",IF(ISBLANK(G33),\" \",ROUND((G33)/G$26*100,0))))","v":"  "},null,{"$f":"IF(ISBLANK(I$26),\"  \",IF(ISBLANK(I$27),\" \",IF(ISBLANK(I33),\" \",ROUND((I33)/I$26*100,0))))","v":"  "},null,{"$f":"IF(ISBLANK(K$26),\"  \",IF(ISBLANK(K$27),\" \",IF(ISBLANK(K33),\" \",ROUND((K33)/K$26*100,0))))","v":"  "},null,{"$f":"IF(ISBLANK(M$26),\"  \",IF(ISBLANK(M$27),\" \",IF(ISBLANK(M33),\" \",ROUND((M33)/M$26*100,0))))","v":"  "}]
["Tested By"]
["Remarks"]

{"sheet":"S4","index":3,"n_rows":35,"n_cols":14,"rows_kept":35,"cut":false,"hidden":true,"merged":[[34,12,37,13],[10,0,10,1],[9,0,9,1],[7,10,7,11],[7,12,7,13],[8,0,8,1],[8,2,8,3],[8,4,8,5],[8,6,8,7],[8,8,8,9],[8,10,8,11],[8,12,8,13],[17,2,17,3],[17,4,17,5],[18,0,21,1],[18,2,21,3],[5,3,5,8],[7,0,7,1],[7,2,7,3],[7,4,7,5],[7,6,7,7],[7,8,7,9],[3,10,3,11],[3,12,3,13],[0,0,3,1],[1,10,1,11],[1,12,1,13],[2,10,2,11],[2,12,2,13],[0,8,3,9],[1,2,1,7],[2,2,2,7],[3,2,3,7],[17,6,17,7],[34,0,37,1],[34,2,37,3],[34,4,37,5],[18,4,21,5],[18,6,21,7],[34,6,37,7],[24,6,24,7],[33,2,33,3],[33,4,33,5],[17,0,17,1],[17,12,17,13],[23,12,23,13],[33,8,33,9],[33,10,33,11],[23,8,23,9],[23,10,23,11],[18,8,21,9],[18,10,21,11],[18,12,21,13],[24,8,24,9],[24,10,24,11],[24,12,24,13],[33,12,33,13],[34,8,37,9],[34,10,37,11],[17,8,17,9],[17,10,17,11],[4,0,4,1],[25,0,25,1],[33,0,33,1],[26,0,26,1],[33,6,33,7],[23,0,23,1],[23,2,23,3],[23,4,23,5],[23,6,23,7],[24,0,24,1],[24,2,24,3],[24,4,24,5]]}
[]
[null,null,"COMMONWEALTH OF PENNSYLVANIA",null,null,null,null,null,null,null,"DISTRICT",null,{"$f":"IF(ISBLANK('S1'!L2),\" \",'S1'!L2)","v":" "}]
[null,null,"DEPARTMENT OF TRANSPORTATION",null,null,null,null,null,null,null,"PLANT CODE",null,{"$f":"IF(ISBLANK('S1'!L3),\" \",'S1'!L3)","v":" "}]
[null,null,"PENNSYLVANIA TURNPIKE COMMISSION",null,null,null,null,null,null,null,"AGG SIZE",null,{"$f":"IF(ISBLANK('S1'!L4),\" \",'S1'!L4)","v":"Type 2"}]
[{"$f":"'S1'!$A$5","v":"Aggregate 2023"}]
[null,null,null,{"$f":"'S1'!D6","v":"Material Test Results for Type 2 Anti-Skid"}]
[]
["Sample No."]
["Date"]
["Starting Weight",null,null,"% Loss",null,"% Loss",null,"% Loss",null,"% Loss",null,"% Loss",null,"% Loss"]
["Ending Weight",null,null,{"$f":"IF(ISBLANK(C10),\" \",IF(ISBLANK(C11),\" \",(C10-C11)/C10*100))","v":" "},null,{"$f":"IF(ISBLANK(E10),\" \",IF(ISBLANK(E11),\" \",(E10-E11)/E10*100))","v":" "},null,{"$f":"IF(ISBLANK(G10),\" \",IF(ISBLANK(G11),\" \",(G10-G11)/G10*100))","v":" "},null,{"$f":"IF(ISBLANK(I10),\" \",IF(ISBLANK(I11),\" \",(I10-I11)/I10*100))","v":" "},null,{"$f":"IF(ISBLANK(K10),\" \",IF(ISBLANK(K11),\" \",(K10-K11)/K10*100))","v":" "},null,{"$f":"IF(ISBLANK(M10),\" \",IF(ISBLANK(M11),\" \",(M10-M11)/M10*100))","v":" "}]
["Spec","Sieve","Wt","% Passing","Wt","% Passing","Wt","% Passing","Wt","% Passing","Wt","% Passing","Wt","% Passing"]
[{"$f":"'S1'!A13","v":"100"},{"$f":"'S1'!B13","v":0.5},null,{"$f":"IF(ISBLANK(C$10),\"  \",IF(ISBLANK(C$11),\" \",IF(ISBLANK(C13),\" \",ROUND((C13)/C$10*100,1))))","v":"  "},null,{"$f":"IF(ISBLANK(E$10),\"  \",IF(ISBLANK(E$11),\" \",IF(ISBLANK(E13),\" \",ROUND((E13)/E$10*100,1))))","v":"  "},null,{"$f":"IF(ISBLANK(G$10),\"  \",IF(ISBLANK(G$11),\" \",IF(ISBLANK(G13),\" \",ROUND((G13)/G$10*100,1))))","v":"  "},null,{"$f":"IF(ISBLANK(I$10),\"  \",IF(ISBLANK(I$11),\" \",IF(ISBLANK(I13),\" \",ROUND((I13)/I$10*100,1))))","v":"  "},null,{"$f":"IF(ISBLANK(K$10),\"  \",IF(ISBLANK(K$11),\" \",IF(ISBLANK(K13),\" \",ROUND((K13)/K$10*100,1))))","v":"  "},null,{"$f":"IF(ISBLANK(M$10),\"  \",IF(ISBLANK(M$11),\" \",IF(ISBLANK(M13),\" \",ROUND((M13)/M$10*100,1))))","v":"  "}]
[{"$f":"'S1'!A14","v":"95-100"},{"$f":"'S1'!B14","v":0.375},null,{"$f":"IF(ISBLANK(C$10),\"  \",IF(ISBLANK(C$11),\" \",IF(ISBLANK(C14),\" \",ROUND((C14)/C$10*100,0))))","v":"  "},null,{"$f":"IF(ISBLANK(E$10),\"  \",IF(ISBLANK(E$11),\" \",IF(ISBLANK(E14),\" \",ROUND((E14)/E$10*100,0))))","v":"  "},null,{"$f":"IF(ISBLANK(G$10),\"  \",IF(ISBLANK(G$11),\" \",IF(ISBLANK(G14),\" \",ROUND((G14)/G$10*100,0))))","v":"  "},null,{"$f":"IF(ISBLANK(I$10),\"  \",IF(ISBLANK(I$11),\" \",IF(ISBLANK(I14),\" \",ROUND((I14)/I$10*100,0))))","v":"  "},null,{"$f":"IF(ISBLANK(K$10),\"  \",IF(ISBLANK(K$11),\" \",IF(ISBLANK(K14),\" \",ROUND((K14)/K$10*100,0))))","v":"  "},null,{"$f":"IF(ISBLANK(M$10),\"  \",IF(ISBLANK(M$11),\" \",IF(ISBLANK(M14),\" \",ROUND((M14)/M$10*100,0))))","v":"  "}]
[{"$f":"'S1'!A15","v":"Breaker"},{"$f":"'S1'!B15","v":4},null,{"$f":"IF(ISBLANK(C$10),\"  \",IF(ISBLANK(C$11),\" \",IF(ISBLANK(C15),\" \",ROUND((C15)/C$10*100,0))))","v":"  "},null,{"$f":"IF(ISBLANK(E$10),\"  \",IF(ISBLANK(E$11),\" \",IF(ISBLANK(E15),\" \",ROUND((E15)/E$10*100,0))))","v":"  "},null,{"$f":"IF(ISBLANK(G$10),\"  \",IF(ISBLANK(G$11),\" \",IF(ISBLANK(G15),\" \",ROUND((G15)/G$10*100,0))))","v":"  "},null,{"$f":"IF(ISBLANK(I$10),\"  \",IF(ISBLANK(I$11),\" \",IF(ISBLANK(I15),\" \",ROUND((I15)/I$10*100,0))))","v":"  "},null,{"$f":"IF(ISBLANK(K$10),\"  \",IF(ISBLANK(K$11),\" \",IF(ISBLANK(K15),\" \",ROUND((K15)/K$10*100,0))))","v":"  "},null,{"$f":"IF(ISBLANK(M$10),\"  \",IF(ISBLANK(M$11),\" \",IF(ISBLANK(M15),\" \",ROUND((M15)/M$10*100,0))))","v":"  "}]
[{"$f":"'S1'!A16","v":"0-30"},{"$f":"'S1'!B16","v":8},null,{"$f":"IF(ISBLANK(C$10),\"  \",IF(ISBLANK(C$11),\" \",IF(ISBLANK(C16),\" \",ROUND((C16)/C$10*100,0))))","v":"  "},null,{"$f":"IF(ISBLANK(E$10),\"  \",IF(ISBLANK(E$11),\" \",IF(ISBLANK(E16),\" \",ROUND((E16)/E$10*100,0))))","v":"  "},null,{"$f":"IF(ISBLANK(G$10),\"  \",IF(ISBLANK(G$11),\" \",IF(ISBLANK(G16),\" \",ROUND((G16)/G$10*100,0))))","v":"  "},null,{"$f":"IF(ISBLANK(I$10),\"  \",IF(ISBLANK(I$11),\" \",IF(ISBLANK(I16),\" \",ROUND((I16)/I$10*100,0))))","v":"  "},null,{"$f":"IF(ISBLANK(K$10),\"  \",IF(ISBLANK(K$11),\" \",IF(ISBLANK(K16),\" \",ROUND((K16)/K$10*100,0))))","v":"  "},null,{"$f":"IF(ISBLANK(M$10),\"  \",IF(ISBLANK(M$11),\" \",IF(ISBLANK(M16),\" \",ROUND((M16)/M$10*100,0))))","v":"  "}]
[{"$f":"'S1'!A17","v":"0-8"},{"$f":"'S1'!B17","v":100},null,{"$f":"IF(ISBLANK(C$10),\"  \",IF(ISBLANK(C$11),\" \",IF(ISBLANK(C17),\" \",ROUND((C17)/C$10*100,0))))","v":"  "},null,{"$f":"IF(ISBLANK(E$10),\"  \",IF(ISBLANK(E$11),\" \",IF(ISBLANK(E17),\" \",ROUND((E17)/E$10*100,0))))","v":"  "},null,{"$f":"IF(ISBLANK(G$10),\"  \",IF(ISBLANK(G$11),\" \",IF(ISBLANK(G17),\" \",ROUND((G17)/G$10*100,0))))","v":"  "},null,{"$f":"IF(ISBLANK(I$10),\"  \",IF(ISBLANK(I$11),\" \",IF(ISBLANK(I17),\" \",ROUND((I17)/I$10*100,0))))","v":"  "},null,{"$f":"IF(ISBLANK(K$10),\"  \",IF(ISBLANK(K$11),\" \",IF(ISBLANK(K17),\" \",ROUND((K17)/K$10*100,0))))","v":"  "},null,{"$f":"IF(ISBLANK(M$10),\"  \",IF(ISBLANK(M$11),\" \",IF(ISBLANK(M17),\" \",ROUND((M17)/M$10*100,0))))","v":"  "}]
["Tested By"]
["Remarks"]
[]
[]
[]
[]
["Sample No."]
["Date"]
["Starting Weight",null,null,"% Loss",null,"% Loss",null,"% Loss",null,"% Loss",null,"% Loss",null,"% Loss"]
["Ending Weight",null,null,{"$f":"IF(ISBLANK(C26),\" \",IF(ISBLANK(C27),\" \",(C26-C27)/C26*100))","v":" "},null,{"$f":"IF(ISBLANK(E26),\" \",IF(ISBLANK(E27),\" \",(E26-E27)/E26*100))","v":" "},null,{"$f":"IF(ISBLANK(G26),\" \",IF(ISBLANK(G27),\" \",(G26-G27)/G26*100))","v":" "},null,{"$f":"IF(ISBLANK(I26),\" \",IF(ISBLANK(I27),\" \",(I26-I27)/I26*100))","v":" "},null,{"$f":"IF(ISBLANK(K26),\" \",IF(ISBLANK(K27),\" \",(K26-K27)/K26*100))","v":" "},null,{"$f":"IF(ISBLANK(M26),\" \",IF(ISBLANK(M27),\" \",(M26-M27)/M26*100))","v":" "}]
["Spec","Sieve","Wt","% Passing","Wt","% Passing","Wt","% Passing","Wt","% Passing","Wt","% Passing","Wt","% Passing"]
[{"$f":"'S1'!A29","v":"100"},{"$f":"'S1'!B29","v":0.5},null,{"$f":"IF(ISBLANK(C$26),\"  \",IF(ISBLANK(C$27),\" \",IF(ISBLANK(C29),\" \",ROUND((C29)/C$26*100,1))))","v":"  "},null,{"$f":"IF(ISBLANK(E$26),\"  \",IF(ISBLANK(E$27),\" \",IF(ISBLANK(E29),\" \",ROUND((E29)/E$26*100,1))))","v":"  "},null,{"$f":"IF(ISBLANK(G$26),\"  \",IF(ISBLANK(G$27),\" \",IF(ISBLANK(G29),\" \",ROUND((G29)/G$26*100,1))))","v":"  "},null,{"$f":"IF(ISBLANK(I$26),\"  \",IF(ISBLANK(I$27),\" \",IF(ISBLANK(I29),\" \",ROUND((I29)/I$26*100,1))))","v":"  "},null,{"$f":"IF(ISBLANK(K$26),\"  \",IF(ISBLANK(K$27),\" \",IF(ISBLANK(K29),\" \",ROUND((K29)/K$26*100,1))))","v":"  "},null,{"$f":"IF(ISBLANK(M$26),\"  \",IF(ISBLANK(M$27),\" \",IF(ISBLANK(M29),\" \",ROUND((M29)/M$26*100,1))))","v":"  "}]
[{"$f":"'S1'!A30","v":"95-100"},{"$f":"'S1'!B30","v":0.375},null,{"$f":"IF(ISBLANK(C$26),\"  \",IF(ISBLANK(C$27),\" \",IF(ISBLANK(C30),\" \",ROUND((C30)/C$26*100,0))))","v":"  "},null,{"$f":"IF(ISBLANK(E$26),\"  \",IF(ISBLANK(E$27),\" \",IF(ISBLANK(E30),\" \",ROUND((E30)/E$26*100,0))))","v":"  "},null,{"$f":"IF(ISBLANK(G$26),\"  \",IF(ISBLANK(G$27),\" \",IF(ISBLANK(G30),\" \",ROUND((G30)/G$26*100,0))))","v":"  "},null,{"$f":"IF(ISBLANK(I$26),\"  \",IF(ISBLANK(I$27),\" \",IF(ISBLANK(I30),\" \",ROUND((I30)/I$26*100,0))))","v":"  "},null,{"$f":"IF(ISBLANK(K$26),\"  \",IF(ISBLANK(K$27),\" \",IF(ISBLANK(K30),\" \",ROUND((K30)/K$26*100,0))))","v":"  "},null,{"$f":"IF(ISBLANK(M$26),\"  \",IF(ISBLANK(M$27),\" \",IF(ISBLANK(M30),\" \",ROUND((M30)/M$26*100,0))))","v":"  "}]
[{"$f":"'S1'!A31","v":"Breaker"},{"$f":"'S1'!B31","v":4},null,{"$f":"IF(ISBLANK(C$26),\"  \",IF(ISBLANK(C$27),\" \",IF(ISBLANK(C31),\" \",ROUND((C31)/C$26*100,0))))","v":"  "},null,{"$f":"IF(ISBLANK(E$26),\"  \",IF(ISBLANK(E$27),\" \",IF(ISBLANK(E31),\" \",ROUND((E31)/E$26*100,0))))","v":"  "},null,{"$f":"IF(ISBLANK(G$26),\"  \",IF(ISBLANK(G$27),\" \",IF(ISBLANK(G31),\" \",ROUND((G31)/G$26*100,0))))","v":"  "},null,{"$f":"IF(ISBLANK(I$26),\"  \",IF(ISBLANK(I$27),\" \",IF(ISBLANK(I31),\" \",ROUND((I31)/I$26*100,0))))","v":"  "},null,{"$f":"IF(ISBLANK(K$26),\"  \",IF(ISBLANK(K$27),\" \",IF(ISBLANK(K31),\" \",ROUND((K31)/K$26*100,0))))","v":"  "},null,{"$f":"IF(ISBLANK(M$26),\"  \",IF(ISBLANK(M$27),\" \",IF(ISBLANK(M31),\" \",ROUND((M31)/M$26*100,0))))","v":"  "}]
[{"$f":"'S1'!A32","v":"0-30"},{"$f":"'S1'!B32","v":8},null,{"$f":"IF(ISBLANK(C$26),\"  \",IF(ISBLANK(C$27),\" \",IF(ISBLANK(C32),\" \",ROUND((C32)/C$26*100,0))))","v":"  "},null,{"$f":"IF(ISBLANK(E$26),\"  \",IF(ISBLANK(E$27),\" \",IF(ISBLANK(E32),\" \",ROUND((E32)/E$26*100,0))))","v":"  "},null,{"$f":"IF(ISBLANK(G$26),\"  \",IF(ISBLANK(G$27),\" \",IF(ISBLANK(G32),\" \",ROUND((G32)/G$26*100,0))))","v":"  "},null,{"$f":"IF(ISBLANK(I$26),\"  \",IF(ISBLANK(I$27),\" \",IF(ISBLANK(I32),\" \",ROUND((I32)/I$26*100,0))))","v":"  "},null,{"$f":"IF(ISBLANK(K$26),\"  \",IF(ISBLANK(K$27),\" \",IF(ISBLANK(K32),\" \",ROUND((K32)/K$26*100,0))))","v":"  "},null,{"$f":"IF(ISBLANK(M$26),\"  \",IF(ISBLANK(M$27),\" \",IF(ISBLANK(M32),\" \",ROUND((M32)/M$26*100,0))))","v":"  "}]
[{"$f":"'S1'!A33","v":"0-8"},{"$f":"'S1'!B33","v":100},null,{"$f":"IF(ISBLANK(C$26),\"  \",IF(ISBLANK(C$27),\" \",IF(ISBLANK(C33),\" \",ROUND((C33)/C$26*100,0))))","v":"  "},null,{"$f":"IF(ISBLANK(E$26),\"  \",IF(ISBLANK(E$27),\" \",IF(ISBLANK(E33),\" \",ROUND((E33)/E$26*100,0))))","v":"  "},null,{"$f":"IF(ISBLANK(G$26),\"  \",IF(ISBLANK(G$27),\" \",IF(ISBLANK(G33),\" \",ROUND((G33)/G$26*100,0))))","v":"  "},null,{"$f":"IF(ISBLANK(I$26),\"  \",IF(ISBLANK(I$27),\" \",IF(ISBLANK(I33),\" \",ROUND((I33)/I$26*100,0))))","v":"  "},null,{"$f":"IF(ISBLANK(K$26),\"  \",IF(ISBLANK(K$27),\" \",IF(ISBLANK(K33),\" \",ROUND((K33)/K$26*100,0))))","v":"  "},null,{"$f":"IF(ISBLANK(M$26),\"  \",IF(ISBLANK(M$27),\" \",IF(ISBLANK(M33),\" \",ROUND((M33)/M$26*100,0))))","v":"  "}]
["Tested By"]
["Remarks"]

{"sheet":"S5","index":4,"n_rows":35,"n_cols":14,"rows_kept":35,"cut":false,"hidden":true,"merged":[[34,12,37,13],[10,0,10,1],[9,0,9,1],[7,10,7,11],[7,12,7,13],[8,0,8,1],[8,2,8,3],[8,4,8,5],[8,6,8,7],[8,8,8,9],[8,10,8,11],[8,12,8,13],[17,2,17,3],[17,4,17,5],[18,0,21,1],[18,2,21,3],[5,3,5,8],[7,0,7,1],[7,2,7,3],[7,4,7,5],[7,6,7,7],[7,8,7,9],[3,10,3,11],[3,12,3,13],[0,0,3,1],[1,10,1,11],[1,12,1,13],[2,10,2,11],[2,12,2,13],[0,8,3,9],[1,2,1,7],[2,2,2,7],[3,2,3,7],[17,6,17,7],[34,0,37,1],[34,2,37,3],[34,4,37,5],[18,4,21,5],[18,6,21,7],[34,6,37,7],[24,6,24,7],[33,2,33,3],[33,4,33,5],[17,0,17,1],[17,12,17,13],[23,12,23,13],[33,8,33,9],[33,10,33,11],[23,8,23,9],[23,10,23,11],[18,8,21,9],[18,10,21,11],[18,12,21,13],[24,8,24,9],[24,10,24,11],[24,12,24,13],[33,12,33,13],[34,8,37,9],[34,10,37,11],[17,8,17,9],[17,10,17,11],[4,0,4,1],[25,0,25,1],[33,0,33,1],[26,0,26,1],[33,6,33,7],[23,0,23,1],[23,2,23,3],[23,4,23,5],[23,6,23,7],[24,0,24,1],[24,2,24,3],[24,4,24,5]]}
[]
[null,null,"COMMONWEALTH OF PENNSYLVANIA",null,null,null,null,null,null,null,"DISTRICT",null,{"$f":"IF(ISBLANK('S1'!L2),\" \",'S1'!L2)","v":" "}]
[null,null,"DEPARTMENT OF TRANSPORTATION",null,null,null,null,null,null,null,"PLANT CODE",null,{"$f":"IF(ISBLANK('S1'!L3),\" \",'S1'!L3)","v":" "}]
[null,null,"PENNSYLVANIA TURNPIKE COMMISSION",null,null,null,null,null,null,null,"AGG SIZE",null,{"$f":"IF(ISBLANK('S1'!L4),\" \",'S1'!L4)","v":"Type 2"}]
[{"$f":"'S1'!$A$5","v":"Aggregate 2023"}]
[null,null,null,{"$f":"'S1'!D6","v":"Material Test Results for Type 2 Anti-Skid"}]
[]
["Sample No."]
["Date"]
["Starting Weight",null,null,"% Loss",null,"% Loss",null,"% Loss",null,"% Loss",null,"% Loss",null,"% Loss"]
["Ending Weight",null,null,{"$f":"IF(ISBLANK(C10),\" \",IF(ISBLANK(C11),\" \",(C10-C11)/C10*100))","v":" "},null,{"$f":"IF(ISBLANK(E10),\" \",IF(ISBLANK(E11),\" \",(E10-E11)/E10*100))","v":" "},null,{"$f":"IF(ISBLANK(G10),\" \",IF(ISBLANK(G11),\" \",(G10-G11)/G10*100))","v":" "},null,{"$f":"IF(ISBLANK(I10),\" \",IF(ISBLANK(I11),\" \",(I10-I11)/I10*100))","v":" "},null,{"$f":"IF(ISBLANK(K10),\" \",IF(ISBLANK(K11),\" \",(K10-K11)/K10*100))","v":" "},null,{"$f":"IF(ISBLANK(M10),\" \",IF(ISBLANK(M11),\" \",(M10-M11)/M10*100))","v":" "}]
["Spec","Sieve","Wt","% Passing","Wt","% Passing","Wt","% Passing","Wt","% Passing","Wt","% Passing","Wt","% Passing"]
[{"$f":"'S1'!A13","v":"100"},{"$f":"'S1'!B13","v":0.5},null,{"$f":"IF(ISBLANK(C$10),\"  \",IF(ISBLANK(C$11),\" \",IF(ISBLANK(C13),\" \",ROUND((C13)/C$10*100,1))))","v":"  "},null,{"$f":"IF(ISBLANK(E$10),\"  \",IF(ISBLANK(E$11),\" \",IF(ISBLANK(E13),\" \",ROUND((E13)/E$10*100,1))))","v":"  "},null,{"$f":"IF(ISBLANK(G$10),\"  \",IF(ISBLANK(G$11),\" \",IF(ISBLANK(G13),\" \",ROUND((G13)/G$10*100,1))))","v":"  "},null,{"$f":"IF(ISBLANK(I$10),\"  \",IF(ISBLANK(I$11),\" \",IF(ISBLANK(I13),\" \",ROUND((I13)/I$10*100,1))))","v":"  "},null,{"$f":"IF(ISBLANK(K$10),\"  \",IF(ISBLANK(K$11),\" \",IF(ISBLANK(K13),\" \",ROUND((K13)/K$10*100,1))))","v":"  "},null,{"$f":"IF(ISBLANK(M$10),\"  \",IF(ISBLANK(M$11),\" \",IF(ISBLANK(M13),\" \",ROUND((M13)/M$10*100,1))))","v":"  "}]
[{"$f":"'S1'!A14","v":"95-100"},{"$f":"'S1'!B14","v":0.375},null,{"$f":"IF(ISBLANK(C$10),\"  \",IF(ISBLANK(C$11),\" \",IF(ISBLANK(C14),\" \",ROUND((C14)/C$10*100,0))))","v":"  "},null,{"$f":"IF(ISBLANK(E$10),\"  \",IF(ISBLANK(E$11),\" \",IF(ISBLANK(E14),\" \",ROUND((E14)/E$10*100,0))))","v":"  "},null,{"$f":"IF(ISBLANK(G$10),\"  \",IF(ISBLANK(G$11),\" \",IF(ISBLANK(G14),\" \",ROUND((G14)/G$10*100,0))))","v":"  "},null,{"$f":"IF(ISBLANK(I$10),\"  \",IF(ISBLANK(I$11),\" \",IF(ISBLANK(I14),\" \",ROUND((I14)/I$10*100,0))))","v":"  "},null,{"$f":"IF(ISBLANK(K$10),\"  \",IF(ISBLANK(K$11),\" \",IF(ISBLANK(K14),\" \",ROUND((K14)/K$10*100,0))))","v":"  "},null,{"$f":"IF(ISBLANK(M$10),\"  \",IF(ISBLANK(M$11),\" \",IF(ISBLANK(M14),\" \",ROUND((M14)/M$10*100,0))))","v":"  "}]
[{"$f":"'S1'!A15","v":"Breaker"},{"$f":"'S1'!B15","v":4},null,{"$f":"IF(ISBLANK(C$10),\"  \",IF(ISBLANK(C$11),\" \",IF(ISBLANK(C15),\" \",ROUND((C15)/C$10*100,0))))","v":"  "},null,{"$f":"IF(ISBLANK(E$10),\"  \",IF(ISBLANK(E$11),\" \",IF(ISBLANK(E15),\" \",ROUND((E15)/E$10*100,0))))","v":"  "},null,{"$f":"IF(ISBLANK(G$10),\"  \",IF(ISBLANK(G$11),\" \",IF(ISBLANK(G15),\" \",ROUND((G15)/G$10*100,0))))","v":"  "},null,{"$f":"IF(ISBLANK(I$10),\"  \",IF(ISBLANK(I$11),\" \",IF(ISBLANK(I15),\" \",ROUND((I15)/I$10*100,0))))","v":"  "},null,{"$f":"IF(ISBLANK(K$10),\"  \",IF(ISBLANK(K$11),\" \",IF(ISBLANK(K15),\" \",ROUND((K15)/K$10*100,0))))","v":"  "},null,{"$f":"IF(ISBLANK(M$10),\"  \",IF(ISBLANK(M$11),\" \",IF(ISBLANK(M15),\" \",ROUND((M15)/M$10*100,0))))","v":"  "}]
[{"$f":"'S1'!A16","v":"0-30"},{"$f":"'S1'!B16","v":8},null,{"$f":"IF(ISBLANK(C$10),\"  \",IF(ISBLANK(C$11),\" \",IF(ISBLANK(C16),\" \",ROUND((C16)/C$10*100,0))))","v":"  "},null,{"$f":"IF(ISBLANK(E$10),\"  \",IF(ISBLANK(E$11),\" \",IF(ISBLANK(E16),\" \",ROUND((E16)/E$10*100,0))))","v":"  "},null,{"$f":"IF(ISBLANK(G$10),\"  \",IF(ISBLANK(G$11),\" \",IF(ISBLANK(G16),\" \",ROUND((G16)/G$10*100,0))))","v":"  "},null,{"$f":"IF(ISBLANK(I$10),\"  \",IF(ISBLANK(I$11),\" \",IF(ISBLANK(I16),\" \",ROUND((I16)/I$10*100,0))))","v":"  "},null,{"$f":"IF(ISBLANK(K$10),\"  \",IF(ISBLANK(K$11),\" \",IF(ISBLANK(K16),\" \",ROUND((K16)/K$10*100,0))))","v":"  "},null,{"$f":"IF(ISBLANK(M$10),\"  \",IF(ISBLANK(M$11),\" \",IF(ISBLANK(M16),\" \",ROUND((M16)/M$10*100,0))))","v":"  "}]
[{"$f":"'S1'!A17","v":"0-8"},{"$f":"'S1'!B17","v":100},null,{"$f":"IF(ISBLANK(C$10),\"  \",IF(ISBLANK(C$11),\" \",IF(ISBLANK(C17),\" \",ROUND((C17)/C$10*100,0))))","v":"  "},null,{"$f":"IF(ISBLANK(E$10),\"  \",IF(ISBLANK(E$11),\" \",IF(ISBLANK(E17),\" \",ROUND((E17)/E$10*100,0))))","v":"  "},null,{"$f":"IF(ISBLANK(G$10),\"  \",IF(ISBLANK(G$11),\" \",IF(ISBLANK(G17),\" \",ROUND((G17)/G$10*100,0))))","v":"  "},null,{"$f":"IF(ISBLANK(I$10),\"  \",IF(ISBLANK(I$11),\" \",IF(ISBLANK(I17),\" \",ROUND((I17)/I$10*100,0))))","v":"  "},null,{"$f":"IF(ISBLANK(K$10),\"  \",IF(ISBLANK(K$11),\" \",IF(ISBLANK(K17),\" \",ROUND((K17)/K$10*100,0))))","v":"  "},null,{"$f":"IF(ISBLANK(M$10),\"  \",IF(ISBLANK(M$11),\" \",IF(ISBLANK(M17),\" \",ROUND((M17)/M$10*100,0))))","v":"  "}]
["Tested By"]
["Remarks"]
[]
[]
[]
[]
["Sample No."]
["Date"]
["Starting Weight",null,null,"% Loss",null,"% Loss",null,"% Loss",null,"% Loss",null,"% Loss",null,"% Loss"]
["Ending Weight",null,null,{"$f":"IF(ISBLANK(C26),\" \",IF(ISBLANK(C27),\" \",(C26-C27)/C26*100))","v":" "},null,{"$f":"IF(ISBLANK(E26),\" \",IF(ISBLANK(E27),\" \",(E26-E27)/E26*100))","v":" "},null,{"$f":"IF(ISBLANK(G26),\" \",IF(ISBLANK(G27),\" \",(G26-G27)/G26*100))","v":" "},null,{"$f":"IF(ISBLANK(I26),\" \",IF(ISBLANK(I27),\" \",(I26-I27)/I26*100))","v":" "},null,{"$f":"IF(ISBLANK(K26),\" \",IF(ISBLANK(K27),\" \",(K26-K27)/K26*100))","v":" "},null,{"$f":"IF(ISBLANK(M26),\" \",IF(ISBLANK(M27),\" \",(M26-M27)/M26*100))","v":" "}]
["Spec","Sieve","Wt","% Passing","Wt","% Passing","Wt","% Passing","Wt","% Passing","Wt","% Passing","Wt","% Passing"]
[{"$f":"'S1'!A29","v":"100"},{"$f":"'S1'!B29","v":0.5},null,{"$f":"IF(ISBLANK(C$26),\"  \",IF(ISBLANK(C$27),\" \",IF(ISBLANK(C29),\" \",ROUND((C29)/C$26*100,1))))","v":"  "},null,{"$f":"IF(ISBLANK(E$26),\"  \",IF(ISBLANK(E$27),\" \",IF(ISBLANK(E29),\" \",ROUND((E29)/E$26*100,1))))","v":"  "},null,{"$f":"IF(ISBLANK(G$26),\"  \",IF(ISBLANK(G$27),\" \",IF(ISBLANK(G29),\" \",ROUND((G29)/G$26*100,1))))","v":"  "},null,{"$f":"IF(ISBLANK(I$26),\"  \",IF(ISBLANK(I$27),\" \",IF(ISBLANK(I29),\" \",ROUND((I29)/I$26*100,1))))","v":"  "},null,{"$f":"IF(ISBLANK(K$26),\"  \",IF(ISBLANK(K$27),\" \",IF(ISBLANK(K29),\" \",ROUND((K29)/K$26*100,1))))","v":"  "},null,{"$f":"IF(ISBLANK(M$26),\"  \",IF(ISBLANK(M$27),\" \",IF(ISBLANK(M29),\" \",ROUND((M29)/M$26*100,1))))","v":"  "}]
[{"$f":"'S1'!A30","v":"95-100"},{"$f":"'S1'!B30","v":0.375},null,{"$f":"IF(ISBLANK(C$26),\"  \",IF(ISBLANK(C$27),\" \",IF(ISBLANK(C30),\" \",ROUND((C30)/C$26*100,0))))","v":"  "},null,{"$f":"IF(ISBLANK(E$26),\"  \",IF(ISBLANK(E$27),\" \",IF(ISBLANK(E30),\" \",ROUND((E30)/E$26*100,0))))","v":"  "},null,{"$f":"IF(ISBLANK(G$26),\"  \",IF(ISBLANK(G$27),\" \",IF(ISBLANK(G30),\" \",ROUND((G30)/G$26*100,0))))","v":"  "},null,{"$f":"IF(ISBLANK(I$26),\"  \",IF(ISBLANK(I$27),\" \",IF(ISBLANK(I30),\" \",ROUND((I30)/I$26*100,0))))","v":"  "},null,{"$f":"IF(ISBLANK(K$26),\"  \",IF(ISBLANK(K$27),\" \",IF(ISBLANK(K30),\" \",ROUND((K30)/K$26*100,0))))","v":"  "},null,{"$f":"IF(ISBLANK(M$26),\"  \",IF(ISBLANK(M$27),\" \",IF(ISBLANK(M30),\" \",ROUND((M30)/M$26*100,0))))","v":"  "}]
[{"$f":"'S1'!A31","v":"Breaker"},{"$f":"'S1'!B31","v":4},null,{"$f":"IF(ISBLANK(C$26),\"  \",IF(ISBLANK(C$27),\" \",IF(ISBLANK(C31),\" \",ROUND((C31)/C$26*100,0))))","v":"  "},null,{"$f":"IF(ISBLANK(E$26),\"  \",IF(ISBLANK(E$27),\" \",IF(ISBLANK(E31),\" \",ROUND((E31)/E$26*100,0))))","v":"  "},null,{"$f":"IF(ISBLANK(G$26),\"  \",IF(ISBLANK(G$27),\" \",IF(ISBLANK(G31),\" \",ROUND((G31)/G$26*100,0))))","v":"  "},null,{"$f":"IF(ISBLANK(I$26),\"  \",IF(ISBLANK(I$27),\" \",IF(ISBLANK(I31),\" \",ROUND((I31)/I$26*100,0))))","v":"  "},null,{"$f":"IF(ISBLANK(K$26),\"  \",IF(ISBLANK(K$27),\" \",IF(ISBLANK(K31),\" \",ROUND((K31)/K$26*100,0))))","v":"  "},null,{"$f":"IF(ISBLANK(M$26),\"  \",IF(ISBLANK(M$27),\" \",IF(ISBLANK(M31),\" \",ROUND((M31)/M$26*100,0))))","v":"  "}]
[{"$f":"'S1'!A32","v":"0-30"},{"$f":"'S1'!B32","v":8},null,{"$f":"IF(ISBLANK(C$26),\"  \",IF(ISBLANK(C$27),\" \",IF(ISBLANK(C32),\" \",ROUND((C32)/C$26*100,0))))","v":"  "},null,{"$f":"IF(ISBLANK(E$26),\"  \",IF(ISBLANK(E$27),\" \",IF(ISBLANK(E32),\" \",ROUND((E32)/E$26*100,0))))","v":"  "},null,{"$f":"IF(ISBLANK(G$26),\"  \",IF(ISBLANK(G$27),\" \",IF(ISBLANK(G32),\" \",ROUND((G32)/G$26*100,0))))","v":"  "},null,{"$f":"IF(ISBLANK(I$26),\"  \",IF(ISBLANK(I$27),\" \",IF(ISBLANK(I32),\" \",ROUND((I32)/I$26*100,0))))","v":"  "},null,{"$f":"IF(ISBLANK(K$26),\"  \",IF(ISBLANK(K$27),\" \",IF(ISBLANK(K32),\" \",ROUND((K32)/K$26*100,0))))","v":"  "},null,{"$f":"IF(ISBLANK(M$26),\"  \",IF(ISBLANK(M$27),\" \",IF(ISBLANK(M32),\" \",ROUND((M32)/M$26*100,0))))","v":"  "}]
[{"$f":"'S1'!A33","v":"0-8"},{"$f":"'S1'!B33","v":100},null,{"$f":"IF(ISBLANK(C$26),\"  \",IF(ISBLANK(C$27),\" \",IF(ISBLANK(C33),\" \",ROUND((C33)/C$26*100,0))))","v":"  "},null,{"$f":"IF(ISBLANK(E$26),\"  \",IF(ISBLANK(E$27),\" \",IF(ISBLANK(E33),\" \",ROUND((E33)/E$26*100,0))))","v":"  "},null,{"$f":"IF(ISBLANK(G$26),\"  \",IF(ISBLANK(G$27),\" \",IF(ISBLANK(G33),\" \",ROUND((G33)/G$26*100,0))))","v":"  "},null,{"$f":"IF(ISBLANK(I$26),\"  \",IF(ISBLANK(I$27),\" \",IF(ISBLANK(I33),\" \",ROUND((I33)/I$26*100,0))))","v":"  "},null,{"$f":"IF(ISBLANK(K$26),\"  \",IF(ISBLANK(K$27),\" \",IF(ISBLANK(K33),\" \",ROUND((K33)/K$26*100,0))))","v":"  "},null,{"$f":"IF(ISBLANK(M$26),\"  \",IF(ISBLANK(M$27),\" \",IF(ISBLANK(M33),\" \",ROUND((M33)/M$26*100,0))))","v":"  "}]
["Tested By"]
["Remarks"]

{"sheet":"S6","index":5,"n_rows":35,"n_cols":14,"rows_kept":35,"cut":false,"hidden":true,"merged":[[34,12,37,13],[10,0,10,1],[9,0,9,1],[7,10,7,11],[7,12,7,13],[8,0,8,1],[8,2,8,3],[8,4,8,5],[8,6,8,7],[8,8,8,9],[8,10,8,11],[8,12,8,13],[17,2,17,3],[17,4,17,5],[18,0,21,1],[18,2,21,3],[5,3,5,8],[7,0,7,1],[7,2,7,3],[7,4,7,5],[7,6,7,7],[7,8,7,9],[3,10,3,11],[3,12,3,13],[0,0,3,1],[1,10,1,11],[1,12,1,13],[2,10,2,11],[2,12,2,13],[0,8,3,9],[1,2,1,7],[2,2,2,7],[3,2,3,7],[17,6,17,7],[34,0,37,1],[34,2,37,3],[34,4,37,5],[18,4,21,5],[18,6,21,7],[34,6,37,7],[24,6,24,7],[33,2,33,3],[33,4,33,5],[17,0,17,1],[17,12,17,13],[23,12,23,13],[33,8,33,9],[33,10,33,11],[23,8,23,9],[23,10,23,11],[18,8,21,9],[18,10,21,11],[18,12,21,13],[24,8,24,9],[24,10,24,11],[24,12,24,13],[33,12,33,13],[34,8,37,9],[34,10,37,11],[17,8,17,9],[17,10,17,11],[4,0,4,1],[25,0,25,1],[33,0,33,1],[26,0,26,1],[33,6,33,7],[23,0,23,1],[23,2,23,3],[23,4,23,5],[23,6,23,7],[24,0,24,1],[24,2,24,3],[24,4,24,5]]}
[]
[null,null,"COMMONWEALTH OF PENNSYLVANIA",null,null,null,null,null,null,null,"DISTRICT",null,{"$f":"IF(ISBLANK('S1'!L2),\" \",'S1'!L2)","v":" "}]
[null,null,"DEPARTMENT OF TRANSPORTATION",null,null,null,null,null,null,null,"PLANT CODE",null,{"$f":"IF(ISBLANK('S1'!L3),\" \",'S1'!L3)","v":" "}]
[null,null,"PENNSYLVANIA TURNPIKE COMMISSION",null,null,null,null,null,null,null,"AGG SIZE",null,{"$f":"IF(ISBLANK('S1'!L4),\" \",'S1'!L4)","v":"Type 2"}]
[{"$f":"'S1'!$A$5","v":"Aggregate 2023"}]
[null,null,null,{"$f":"'S1'!D6","v":"Material Test Results for Type 2 Anti-Skid"}]
[]
["Sample No."]
["Date"]
["Starting Weight",null,null,"% Loss",null,"% Loss",null,"% Loss",null,"% Loss",null,"% Loss",null,"% Loss"]
["Ending Weight",null,null,{"$f":"IF(ISBLANK(C10),\" \",IF(ISBLANK(C11),\" \",(C10-C11)/C10*100))","v":" "},null,{"$f":"IF(ISBLANK(E10),\" \",IF(ISBLANK(E11),\" \",(E10-E11)/E10*100))","v":" "},null,{"$f":"IF(ISBLANK(G10),\" \",IF(ISBLANK(G11),\" \",(G10-G11)/G10*100))","v":" "},null,{"$f":"IF(ISBLANK(I10),\" \",IF(ISBLANK(I11),\" \",(I10-I11)/I10*100))","v":" "},null,{"$f":"IF(ISBLANK(K10),\" \",IF(ISBLANK(K11),\" \",(K10-K11)/K10*100))","v":" "},null,{"$f":"IF(ISBLANK(M10),\" \",IF(ISBLANK(M11),\" \",(M10-M11)/M10*100))","v":" "}]
["Spec","Sieve","Wt","% Passing","Wt","% Passing","Wt","% Passing","Wt","% Passing","Wt","% Passing","Wt","% Passing"]
[{"$f":"'S1'!A13","v":"100"},{"$f":"'S1'!B13","v":0.5},null,{"$f":"IF(ISBLANK(C$10),\"  \",IF(ISBLANK(C$11),\" \",IF(ISBLANK(C13),\" \",ROUND((C13)/C$10*100,1))))","v":"  "},null,{"$f":"IF(ISBLANK(E$10),\"  \",IF(ISBLANK(E$11),\" \",IF(ISBLANK(E13),\" \",ROUND((E13)/E$10*100,1))))","v":"  "},null,{"$f":"IF(ISBLANK(G$10),\"  \",IF(ISBLANK(G$11),\" \",IF(ISBLANK(G13),\" \",ROUND((G13)/G$10*100,1))))","v":"  "},null,{"$f":"IF(ISBLANK(I$10),\"  \",IF(ISBLANK(I$11),\" \",IF(ISBLANK(I13),\" \",ROUND((I13)/I$10*100,1))))","v":"  "},null,{"$f":"IF(ISBLANK(K$10),\"  \",IF(ISBLANK(K$11),\" \",IF(ISBLANK(K13),\" \",ROUND((K13)/K$10*100,1))))","v":"  "},null,{"$f":"IF(ISBLANK(M$10),\"  \",IF(ISBLANK(M$11),\" \",IF(ISBLANK(M13),\" \",ROUND((M13)/M$10*100,1))))","v":"  "}]
[{"$f":"'S1'!A14","v":"95-100"},{"$f":"'S1'!B14","v":0.375},null,{"$f":"IF(ISBLANK(C$10),\"  \",IF(ISBLANK(C$11),\" \",IF(ISBLANK(C14),\" \",ROUND((C14)/C$10*100,0))))","v":"  "},null,{"$f":"IF(ISBLANK(E$10),\"  \",IF(ISBLANK(E$11),\" \",IF(ISBLANK(E14),\" \",ROUND((E14)/E$10*100,0))))","v":"  "},null,{"$f":"IF(ISBLANK(G$10),\"  \",IF(ISBLANK(G$11),\" \",IF(ISBLANK(G14),\" \",ROUND((G14)/G$10*100,0))))","v":"  "},null,{"$f":"IF(ISBLANK(I$10),\"  \",IF(ISBLANK(I$11),\" \",IF(ISBLANK(I14),\" \",ROUND((I14)/I$10*100,0))))","v":"  "},null,{"$f":"IF(ISBLANK(K$10),\"  \",IF(ISBLANK(K$11),\" \",IF(ISBLANK(K14),\" \",ROUND((K14)/K$10*100,0))))","v":"  "},null,{"$f":"IF(ISBLANK(M$10),\"  \",IF(ISBLANK(M$11),\" \",IF(ISBLANK(M14),\" \",ROUND((M14)/M$10*100,0))))","v":"  "}]
[{"$f":"'S1'!A15","v":"Breaker"},{"$f":"'S1'!B15","v":4},null,{"$f":"IF(ISBLANK(C$10),\"  \",IF(ISBLANK(C$11),\" \",IF(ISBLANK(C15),\" \",ROUND((C15)/C$10*100,0))))","v":"  "},null,{"$f":"IF(ISBLANK(E$10),\"  \",IF(ISBLANK(E$11),\" \",IF(ISBLANK(E15),\" \",ROUND((E15)/E$10*100,0))))","v":"  "},null,{"$f":"IF(ISBLANK(G$10),\"  \",IF(ISBLANK(G$11),\" \",IF(ISBLANK(G15),\" \",ROUND((G15)/G$10*100,0))))","v":"  "},null,{"$f":"IF(ISBLANK(I$10),\"  \",IF(ISBLANK(I$11),\" \",IF(ISBLANK(I15),\" \",ROUND((I15)/I$10*100,0))))","v":"  "},null,{"$f":"IF(ISBLANK(K$10),\"  \",IF(ISBLANK(K$11),\" \",IF(ISBLANK(K15),\" \",ROUND((K15)/K$10*100,0))))","v":"  "},null,{"$f":"IF(ISBLANK(M$10),\"  \",IF(ISBLANK(M$11),\" \",IF(ISBLANK(M15),\" \",ROUND((M15)/M$10*100,0))))","v":"  "}]
[{"$f":"'S1'!A16","v":"0-30"},{"$f":"'S1'!B16","v":8},null,{"$f":"IF(ISBLANK(C$10),\"  \",IF(ISBLANK(C$11),\" \",IF(ISBLANK(C16),\" \",ROUND((C16)/C$10*100,0))))","v":"  "},null,{"$f":"IF(ISBLANK(E$10),\"  \",IF(ISBLANK(E$11),\" \",IF(ISBLANK(E16),\" \",ROUND((E16)/E$10*100,0))))","v":"  "},null,{"$f":"IF(ISBLANK(G$10),\"  \",IF(ISBLANK(G$11),\" \",IF(ISBLANK(G16),\" \",ROUND((G16)/G$10*100,0))))","v":"  "},null,{"$f":"IF(ISBLANK(I$10),\"  \",IF(ISBLANK(I$11),\" \",IF(ISBLANK(I16),\" \",ROUND((I16)/I$10*100,0))))","v":"  "},null,{"$f":"IF(ISBLANK(K$10),\"  \",IF(ISBLANK(K$11),\" \",IF(ISBLANK(K16),\" \",ROUND((K16)/K$10*100,0))))","v":"  "},null,{"$f":"IF(ISBLANK(M$10),\"  \",IF(ISBLANK(M$11),\" \",IF(ISBLANK(M16),\" \",ROUND((M16)/M$10*100,0))))","v":"  "}]
[{"$f":"'S1'!A17","v":"0-8"},{"$f":"'S1'!B17","v":100},null,{"$f":"IF(ISBLANK(C$10),\"  \",IF(ISBLANK(C$11),\" \",IF(ISBLANK(C17),\" \",ROUND((C17)/C$10*100,0))))","v":"  "},null,{"$f":"IF(ISBLANK(E$10),\"  \",IF(ISBLANK(E$11),\" \",IF(ISBLANK(E17),\" \",ROUND((E17)/E$10*100,0))))","v":"  "},null,{"$f":"IF(ISBLANK(G$10),\"  \",IF(ISBLANK(G$11),\" \",IF(ISBLANK(G17),\" \",ROUND((G17)/G$10*100,0))))","v":"  "},null,{"$f":"IF(ISBLANK(I$10),\"  \",IF(ISBLANK(I$11),\" \",IF(ISBLANK(I17),\" \",ROUND((I17)/I$10*100,0))))","v":"  "},null,{"$f":"IF(ISBLANK(K$10),\"  \",IF(ISBLANK(K$11),\" \",IF(ISBLANK(K17),\" \",ROUND((K17)/K$10*100,0))))","v":"  "},null,{"$f":"IF(ISBLANK(M$10),\"  \",IF(ISBLANK(M$11),\" \",IF(ISBLANK(M17),\" \",ROUND((M17)/M$10*100,0))))","v":"  "}]
["Tested By"]
["Remarks"]
[]
[]
[]
[]
["Sample No."]
["Date"]
["Starting Weight",null,null,"% Loss",null,"% Loss",null,"% Loss",null,"% Loss",null,"% Loss",null,"% Loss"]
["Ending Weight",null,null,{"$f":"IF(ISBLANK(C26),\" \",IF(ISBLANK(C27),\" \",(C26-C27)/C26*100))","v":" "},null,{"$f":"IF(ISBLANK(E26),\" \",IF(ISBLANK(E27),\" \",(E26-E27)/E26*100))","v":" "},null,{"$f":"IF(ISBLANK(G26),\" \",IF(ISBLANK(G27),\" \",(G26-G27)/G26*100))","v":" "},null,{"$f":"IF(ISBLANK(I26),\" \",IF(ISBLANK(I27),\" \",(I26-I27)/I26*100))","v":" "},null,{"$f":"IF(ISBLANK(K26),\" \",IF(ISBLANK(K27),\" \",(K26-K27)/K26*100))","v":" "},null,{"$f":"IF(ISBLANK(M26),\" \",IF(ISBLANK(M27),\" \",(M26-M27)/M26*100))","v":" "}]
["Spec","Sieve","Wt","% Passing","Wt","% Passing","Wt","% Passing","Wt","% Passing","Wt","% Passing","Wt","% Passing"]
[{"$f":"'S1'!A29","v":"100"},{"$f":"'S1'!B29","v":0.5},null,{"$f":"IF(ISBLANK(C$26),\"  \",IF(ISBLANK(C$27),\" \",IF(ISBLANK(C29),\" \",ROUND((C29)/C$26*100,1))))","v":"  "},null,{"$f":"IF(ISBLANK(E$26),\"  \",IF(ISBLANK(E$27),\" \",IF(ISBLANK(E29),\" \",ROUND((E29)/E$26*100,1))))","v":"  "},null,{"$f":"IF(ISBLANK(G$26),\"  \",IF(ISBLANK(G$27),\" \",IF(ISBLANK(G29),\" \",ROUND((G29)/G$26*100,1))))","v":"  "},null,{"$f":"IF(ISBLANK(I$26),\"  \",IF(ISBLANK(I$27),\" \",IF(ISBLANK(I29),\" \",ROUND((I29)/I$26*100,1))))","v":"  "},null,{"$f":"IF(ISBLANK(K$26),\"  \",IF(ISBLANK(K$27),\" \",IF(ISBLANK(K29),\" \",ROUND((K29)/K$26*100,1))))","v":"  "},null,{"$f":"IF(ISBLANK(M$26),\"  \",IF(ISBLANK(M$27),\" \",IF(ISBLANK(M29),\" \",ROUND((M29)/M$26*100,1))))","v":"  "}]
[{"$f":"'S1'!A30","v":"95-100"},{"$f":"'S1'!B30","v":0.375},null,{"$f":"IF(ISBLANK(C$26),\"  \",IF(ISBLANK(C$27),\" \",IF(ISBLANK(C30),\" \",ROUND((C30)/C$26*100,0))))","v":"  "},null,{"$f":"IF(ISBLANK(E$26),\"  \",IF(ISBLANK(E$27),\" \",IF(ISBLANK(E30),\" \",ROUND((E30)/E$26*100,0))))","v":"  "},null,{"$f":"IF(ISBLANK(G$26),\"  \",IF(ISBLANK(G$27),\" \",IF(ISBLANK(G30),\" \",ROUND((G30)/G$26*100,0))))","v":"  "},null,{"$f":"IF(ISBLANK(I$26),\"  \",IF(ISBLANK(I$27),\" \",IF(ISBLANK(I30),\" \",ROUND((I30)/I$26*100,0))))","v":"  "},null,{"$f":"IF(ISBLANK(K$26),\"  \",IF(ISBLANK(K$27),\" \",IF(ISBLANK(K30),\" \",ROUND((K30)/K$26*100,0))))","v":"  "},null,{"$f":"IF(ISBLANK(M$26),\"  \",IF(ISBLANK(M$27),\" \",IF(ISBLANK(M30),\" \",ROUND((M30)/M$26*100,0))))","v":"  "}]
[{"$f":"'S1'!A31","v":"Breaker"},{"$f":"'S1'!B31","v":4},null,{"$f":"IF(ISBLANK(C$26),\"  \",IF(ISBLANK(C$27),\" \",IF(ISBLANK(C31),\" \",ROUND((C31)/C$26*100,0))))","v":"  "},null,{"$f":"IF(ISBLANK(E$26),\"  \",IF(ISBLANK(E$27),\" \",IF(ISBLANK(E31),\" \",ROUND((E31)/E$26*100,0))))","v":"  "},null,{"$f":"IF(ISBLANK(G$26),\"  \",IF(ISBLANK(G$27),\" \",IF(ISBLANK(G31),\" \",ROUND((G31)/G$26*100,0))))","v":"  "},null,{"$f":"IF(ISBLANK(I$26),\"  \",IF(ISBLANK(I$27),\" \",IF(ISBLANK(I31),\" \",ROUND((I31)/I$26*100,0))))","v":"  "},null,{"$f":"IF(ISBLANK(K$26),\"  \",IF(ISBLANK(K$27),\" \",IF(ISBLANK(K31),\" \",ROUND((K31)/K$26*100,0))))","v":"  "},null,{"$f":"IF(ISBLANK(M$26),\"  \",IF(ISBLANK(M$27),\" \",IF(ISBLANK(M31),\" \",ROUND((M31)/M$26*100,0))))","v":"  "}]
[{"$f":"'S1'!A32","v":"0-30"},{"$f":"'S1'!B32","v":8},null,{"$f":"IF(ISBLANK(C$26),\"  \",IF(ISBLANK(C$27),\" \",IF(ISBLANK(C32),\" \",ROUND((C32)/C$26*100,0))))","v":"  "},null,{"$f":"IF(ISBLANK(E$26),\"  \",IF(ISBLANK(E$27),\" \",IF(ISBLANK(E32),\" \",ROUND((E32)/E$26*100,0))))","v":"  "},null,{"$f":"IF(ISBLANK(G$26),\"  \",IF(ISBLANK(G$27),\" \",IF(ISBLANK(G32),\" \",ROUND((G32)/G$26*100,0))))","v":"  "},null,{"$f":"IF(ISBLANK(I$26),\"  \",IF(ISBLANK(I$27),\" \",IF(ISBLANK(I32),\" \",ROUND((I32)/I$26*100,0))))","v":"  "},null,{"$f":"IF(ISBLANK(K$26),\"  \",IF(ISBLANK(K$27),\" \",IF(ISBLANK(K32),\" \",ROUND((K32)/K$26*100,0))))","v":"  "},null,{"$f":"IF(ISBLANK(M$26),\"  \",IF(ISBLANK(M$27),\" \",IF(ISBLANK(M32),\" \",ROUND((M32)/M$26*100,0))))","v":"  "}]
[{"$f":"'S1'!A33","v":"0-8"},{"$f":"'S1'!B33","v":100},null,{"$f":"IF(ISBLANK(C$26),\"  \",IF(ISBLANK(C$27),\" \",IF(ISBLANK(C33),\" \",ROUND((C33)/C$26*100,0))))","v":"  "},null,{"$f":"IF(ISBLANK(E$26),\"  \",IF(ISBLANK(E$27),\" \",IF(ISBLANK(E33),\" \",ROUND((E33)/E$26*100,0))))","v":"  "},null,{"$f":"IF(ISBLANK(G$26),\"  \",IF(ISBLANK(G$27),\" \",IF(ISBLANK(G33),\" \",ROUND((G33)/G$26*100,0))))","v":"  "},null,{"$f":"IF(ISBLANK(I$26),\"  \",IF(ISBLANK(I$27),\" \",IF(ISBLANK(I33),\" \",ROUND((I33)/I$26*100,0))))","v":"  "},null,{"$f":"IF(ISBLANK(K$26),\"  \",IF(ISBLANK(K$27),\" \",IF(ISBLANK(K33),\" \",ROUND((K33)/K$26*100,0))))","v":"  "},null,{"$f":"IF(ISBLANK(M$26),\"  \",IF(ISBLANK(M$27),\" \",IF(ISBLANK(M33),\" \",ROUND((M33)/M$26*100,0))))","v":"  "}]
["Tested By"]
["Remarks"]

{"sheet":"S7","index":6,"n_rows":35,"n_cols":14,"rows_kept":35,"cut":false,"hidden":true,"merged":[[34,12,37,13],[10,0,10,1],[9,0,9,1],[7,10,7,11],[7,12,7,13],[8,0,8,1],[8,2,8,3],[8,4,8,5],[8,6,8,7],[8,8,8,9],[8,10,8,11],[8,12,8,13],[17,2,17,3],[17,4,17,5],[18,0,21,1],[18,2,21,3],[5,3,5,8],[7,0,7,1],[7,2,7,3],[7,4,7,5],[7,6,7,7],[7,8,7,9],[3,10,3,11],[3,12,3,13],[0,0,3,1],[1,10,1,11],[1,12,1,13],[2,10,2,11],[2,12,2,13],[0,8,3,9],[1,2,1,7],[2,2,2,7],[3,2,3,7],[17,6,17,7],[34,0,37,1],[34,2,37,3],[34,4,37,5],[18,4,21,5],[18,6,21,7],[34,6,37,7],[24,6,24,7],[33,2,33,3],[33,4,33,5],[17,0,17,1],[17,12,17,13],[23,12,23,13],[33,8,33,9],[33,10,33,11],[23,8,23,9],[23,10,23,11],[18,8,21,9],[18,10,21,11],[18,12,21,13],[24,8,24,9],[24,10,24,11],[24,12,24,13],[33,12,33,13],[34,8,37,9],[34,10,37,11],[17,8,17,9],[17,10,17,11],[4,0,4,1],[25,0,25,1],[33,0,33,1],[26,0,26,1],[33,6,33,7],[23,0,23,1],[23,2,23,3],[23,4,23,5],[23,6,23,7],[24,0,24,1],[24,2,24,3],[24,4,24,5]]}
[]
[null,null,"COMMONWEALTH OF PENNSYLVANIA",null,null,null,null,null,null,null,"DISTRICT",null,{"$f":"IF(ISBLANK('S1'!L2),\" \",'S1'!L2)","v":" "}]
[null,null,"DEPARTMENT OF TRANSPORTATION",null,null,null,null,null,null,null,"PLANT CODE",null,{"$f":"IF(ISBLANK('S1'!L3),\" \",'S1'!L3)","v":" "}]
[null,null,"PENNSYLVANIA TURNPIKE COMMISSION",null,null,null,null,null,null,null,"AGG SIZE",null,{"$f":"IF(ISBLANK('S1'!L4),\" \",'S1'!L4)","v":"Type 2"}]
[{"$f":"'S1'!$A$5","v":"Aggregate 2023"}]
[null,null,null,{"$f":"'S1'!D6","v":"Material Test Results for Type 2 Anti-Skid"}]
[]
["Sample No."]
["Date"]
["Starting Weight",null,null,"% Loss",null,"% Loss",null,"% Loss",null,"% Loss",null,"% Loss",null,"% Loss"]
["Ending Weight",null,null,{"$f":"IF(ISBLANK(C10),\" \",IF(ISBLANK(C11),\" \",(C10-C11)/C10*100))","v":" "},null,{"$f":"IF(ISBLANK(E10),\" \",IF(ISBLANK(E11),\" \",(E10-E11)/E10*100))","v":" "},null,{"$f":"IF(ISBLANK(G10),\" \",IF(ISBLANK(G11),\" \",(G10-G11)/G10*100))","v":" "},null,{"$f":"IF(ISBLANK(I10),\" \",IF(ISBLANK(I11),\" \",(I10-I11)/I10*100))","v":" "},null,{"$f":"IF(ISBLANK(K10),\" \",IF(ISBLANK(K11),\" \",(K10-K11)/K10*100))","v":" "},null,{"$f":"IF(ISBLANK(M10),\" \",IF(ISBLANK(M11),\" \",(M10-M11)/M10*100))","v":" "}]
["Spec","Sieve","Wt","% Passing","Wt","% Passing","Wt","% Passing","Wt","% Passing","Wt","% Passing","Wt","% Passing"]
[{"$f":"'S1'!A13","v":"100"},{"$f":"'S1'!B13","v":0.5},null,{"$f":"IF(ISBLANK(C$10),\"  \",IF(ISBLANK(C$11),\" \",IF(ISBLANK(C13),\" \",ROUND((C13)/C$10*100,1))))","v":"  "},null,{"$f":"IF(ISBLANK(E$10),\"  \",IF(ISBLANK(E$11),\" \",IF(ISBLANK(E13),\" \",ROUND((E13)/E$10*100,1))))","v":"  "},null,{"$f":"IF(ISBLANK(G$10),\"  \",IF(ISBLANK(G$11),\" \",IF(ISBLANK(G13),\" \",ROUND((G13)/G$10*100,1))))","v":"  "},null,{"$f":"IF(ISBLANK(I$10),\"  \",IF(ISBLANK(I$11),\" \",IF(ISBLANK(I13),\" \",ROUND((I13)/I$10*100,1))))","v":"  "},null,{"$f":"IF(ISBLANK(K$10),\"  \",IF(ISBLANK(K$11),\" \",IF(ISBLANK(K13),\" \",ROUND((K13)/K$10*100,1))))","v":"  "},null,{"$f":"IF(ISBLANK(M$10),\"  \",IF(ISBLANK(M$11),\" \",IF(ISBLANK(M13),\" \",ROUND((M13)/M$10*100,1))))","v":"  "}]
[{"$f":"'S1'!A14","v":"95-100"},{"$f":"'S1'!B14","v":0.375},null,{"$f":"IF(ISBLANK(C$10),\"  \",IF(ISBLANK(C$11),\" \",IF(ISBLANK(C14),\" \",ROUND((C14)/C$10*100,0))))","v":"  "},null,{"$f":"IF(ISBLANK(E$10),\"  \",IF(ISBLANK(E$11),\" \",IF(ISBLANK(E14),\" \",ROUND((E14)/E$10*100,0))))","v":"  "},null,{"$f":"IF(ISBLANK(G$10),\"  \",IF(ISBLANK(G$11),\" \",IF(ISBLANK(G14),\" \",ROUND((G14)/G$10*100,0))))","v":"  "},null,{"$f":"IF(ISBLANK(I$10),\"  \",IF(ISBLANK(I$11),\" \",IF(ISBLANK(I14),\" \",ROUND((I14)/I$10*100,0))))","v":"  "},null,{"$f":"IF(ISBLANK(K$10),\"  \",IF(ISBLANK(K$11),\" \",IF(ISBLANK(K14),\" \",ROUND((K14)/K$10*100,0))))","v":"  "},null,{"$f":"IF(ISBLANK(M$10),\"  \",IF(ISBLANK(M$11),\" \",IF(ISBLANK(M14),\" \",ROUND((M14)/M$10*100,0))))","v":"  "}]
[{"$f":"'S1'!A15","v":"Breaker"},{"$f":"'S1'!B15","v":4},null,{"$f":"IF(ISBLANK(C$10),\"  \",IF(ISBLANK(C$11),\" \",IF(ISBLANK(C15),\" \",ROUND((C15)/C$10*100,0))))","v":"  "},null,{"$f":"IF(ISBLANK(E$10),\"  \",IF(ISBLANK(E$11),\" \",IF(ISBLANK(E15),\" \",ROUND((E15)/E$10*100,0))))","v":"  "},null,{"$f":"IF(ISBLANK(G$10),\"  \",IF(ISBLANK(G$11),\" \",IF(ISBLANK(G15),\" \",ROUND((G15)/G$10*100,0))))","v":"  "},null,{"$f":"IF(ISBLANK(I$10),\"  \",IF(ISBLANK(I$11),\" \",IF(ISBLANK(I15),\" \",ROUND((I15)/I$10*100,0))))","v":"  "},null,{"$f":"IF(ISBLANK(K$10),\"  \",IF(ISBLANK(K$11),\" \",IF(ISBLANK(K15),\" \",ROUND((K15)/K$10*100,0))))","v":"  "},null,{"$f":"IF(ISBLANK(M$10),\"  \",IF(ISBLANK(M$11),\" \",IF(ISBLANK(M15),\" \",ROUND((M15)/M$10*100,0))))","v":"  "}]
[{"$f":"'S1'!A16","v":"0-30"},{"$f":"'S1'!B16","v":8},null,{"$f":"IF(ISBLANK(C$10),\"  \",IF(ISBLANK(C$11),\" \",IF(ISBLANK(C16),\" \",ROUND((C16)/C$10*100,0))))","v":"  "},null,{"$f":"IF(ISBLANK(E$10),\"  \",IF(ISBLANK(E$11),\" \",IF(ISBLANK(E16),\" \",ROUND((E16)/E$10*100,0))))","v":"  "},null,{"$f":"IF(ISBLANK(G$10),\"  \",IF(ISBLANK(G$11),\" \",IF(ISBLANK(G16),\" \",ROUND((G16)/G$10*100,0))))","v":"  "},null,{"$f":"IF(ISBLANK(I$10),\"  \",IF(ISBLANK(I$11),\" \",IF(ISBLANK(I16),\" \",ROUND((I16)/I$10*100,0))))","v":"  "},null,{"$f":"IF(ISBLANK(K$10),\"  \",IF(ISBLANK(K$11),\" \",IF(ISBLANK(K16),\" \",ROUND((K16)/K$10*100,0))))","v":"  "},null,{"$f":"IF(ISBLANK(M$10),\"  \",IF(ISBLANK(M$11),\" \",IF(ISBLANK(M16),\" \",ROUND((M16)/M$10*100,0))))","v":"  "}]
[{"$f":"'S1'!A17","v":"0-8"},{"$f":"'S1'!B17","v":100},null,{"$f":"IF(ISBLANK(C$10),\"  \",IF(ISBLANK(C$11),\" \",IF(ISBLANK(C17),\" \",ROUND((C17)/C$10*100,0))))","v":"  "},null,{"$f":"IF(ISBLANK(E$10),\"  \",IF(ISBLANK(E$11),\" \",IF(ISBLANK(E17),\" \",ROUND((E17)/E$10*100,0))))","v":"  "},null,{"$f":"IF(ISBLANK(G$10),\"  \",IF(ISBLANK(G$11),\" \",IF(ISBLANK(G17),\" \",ROUND((G17)/G$10*100,0))))","v":"  "},null,{"$f":"IF(ISBLANK(I$10),\"  \",IF(ISBLANK(I$11),\" \",IF(ISBLANK(I17),\" \",ROUND((I17)/I$10*100,0))))","v":"  "},null,{"$f":"IF(ISBLANK(K$10),\"  \",IF(ISBLANK(K$11),\" \",IF(ISBLANK(K17),\" \",ROUND((K17)/K$10*100,0))))","v":"  "},null,{"$f":"IF(ISBLANK(M$10),\"  \",IF(ISBLANK(M$11),\" \",IF(ISBLANK(M17),\" \",ROUND((M17)/M$10*100,0))))","v":"  "}]
["Tested By"]
["Remarks"]
[]
[]
[]
[]
["Sample No."]
["Date"]
["Starting Weight",null,null,"% Loss",null,"% Loss",null,"% Loss",null,"% Loss",null,"% Loss",null,"% Loss"]
["Ending Weight",null,null,{"$f":"IF(ISBLANK(C26),\" \",IF(ISBLANK(C27),\" \",(C26-C27)/C26*100))","v":" "},null,{"$f":"IF(ISBLANK(E26),\" \",IF(ISBLANK(E27),\" \",(E26-E27)/E26*100))","v":" "},null,{"$f":"IF(ISBLANK(G26),\" \",IF(ISBLANK(G27),\" \",(G26-G27)/G26*100))","v":" "},null,{"$f":"IF(ISBLANK(I26),\" \",IF(ISBLANK(I27),\" \",(I26-I27)/I26*100))","v":" "},null,{"$f":"IF(ISBLANK(K26),\" \",IF(ISBLANK(K27),\" \",(K26-K27)/K26*100))","v":" "},null,{"$f":"IF(ISBLANK(M26),\" \",IF(ISBLANK(M27),\" \",(M26-M27)/M26*100))","v":" "}]
["Spec","Sieve","Wt","% Passing","Wt","% Passing","Wt","% Passing","Wt","% Passing","Wt","% Passing","Wt","% Passing"]
[{"$f":"'S1'!A29","v":"100"},{"$f":"'S1'!B29","v":0.5},null,{"$f":"IF(ISBLANK(C$26),\"  \",IF(ISBLANK(C$27),\" \",IF(ISBLANK(C29),\" \",ROUND((C29)/C$26*100,1))))","v":"  "},null,{"$f":"IF(ISBLANK(E$26),\"  \",IF(ISBLANK(E$27),\" \",IF(ISBLANK(E29),\" \",ROUND((E29)/E$26*100,1))))","v":"  "},null,{"$f":"IF(ISBLANK(G$26),\"  \",IF(ISBLANK(G$27),\" \",IF(ISBLANK(G29),\" \",ROUND((G29)/G$26*100,1))))","v":"  "},null,{"$f":"IF(ISBLANK(I$26),\"  \",IF(ISBLANK(I$27),\" \",IF(ISBLANK(I29),\" \",ROUND((I29)/I$26*100,1))))","v":"  "},null,{"$f":"IF(ISBLANK(K$26),\"  \",IF(ISBLANK(K$27),\" \",IF(ISBLANK(K29),\" \",ROUND((K29)/K$26*100,1))))","v":"  "},null,{"$f":"IF(ISBLANK(M$26),\"  \",IF(ISBLANK(M$27),\" \",IF(ISBLANK(M29),\" \",ROUND((M29)/M$26*100,1))))","v":"  "}]
[{"$f":"'S1'!A30","v":"95-100"},{"$f":"'S1'!B30","v":0.375},null,{"$f":"IF(ISBLANK(C$26),\"  \",IF(ISBLANK(C$27),\" \",IF(ISBLANK(C30),\" \",ROUND((C30)/C$26*100,0))))","v":"  "},null,{"$f":"IF(ISBLANK(E$26),\"  \",IF(ISBLANK(E$27),\" \",IF(ISBLANK(E30),\" \",ROUND((E30)/E$26*100,0))))","v":"  "},null,{"$f":"IF(ISBLANK(G$26),\"  \",IF(ISBLANK(G$27),\" \",IF(ISBLANK(G30),\" \",ROUND((G30)/G$26*100,0))))","v":"  "},null,{"$f":"IF(ISBLANK(I$26),\"  \",IF(ISBLANK(I$27),\" \",IF(ISBLANK(I30),\" \",ROUND((I30)/I$26*100,0))))","v":"  "},null,{"$f":"IF(ISBLANK(K$26),\"  \",IF(ISBLANK(K$27),\" \",IF(ISBLANK(K30),\" \",ROUND((K30)/K$26*100,0))))","v":"  "},null,{"$f":"IF(ISBLANK(M$26),\"  \",IF(ISBLANK(M$27),\" \",IF(ISBLANK(M30),\" \",ROUND((M30)/M$26*100,0))))","v":"  "}]
[{"$f":"'S1'!A31","v":"Breaker"},{"$f":"'S1'!B31","v":4},null,{"$f":"IF(ISBLANK(C$26),\"  \",IF(ISBLANK(C$27),\" \",IF(ISBLANK(C31),\" \",ROUND((C31)/C$26*100,0))))","v":"  "},null,{"$f":"IF(ISBLANK(E$26),\"  \",IF(ISBLANK(E$27),\" \",IF(ISBLANK(E31),\" \",ROUND((E31)/E$26*100,0))))","v":"  "},null,{"$f":"IF(ISBLANK(G$26),\"  \",IF(ISBLANK(G$27),\" \",IF(ISBLANK(G31),\" \",ROUND((G31)/G$26*100,0))))","v":"  "},null,{"$f":"IF(ISBLANK(I$26),\"  \",IF(ISBLANK(I$27),\" \",IF(ISBLANK(I31),\" \",ROUND((I31)/I$26*100,0))))","v":"  "},null,{"$f":"IF(ISBLANK(K$26),\"  \",IF(ISBLANK(K$27),\" \",IF(ISBLANK(K31),\" \",ROUND((K31)/K$26*100,0))))","v":"  "},null,{"$f":"IF(ISBLANK(M$26),\"  \",IF(ISBLANK(M$27),\" \",IF(ISBLANK(M31),\" \",ROUND((M31)/M$26*100,0))))","v":"  "}]
[{"$f":"'S1'!A32","v":"0-30"},{"$f":"'S1'!B32","v":8},null,{"$f":"IF(ISBLANK(C$26),\"  \",IF(ISBLANK(C$27),\" \",IF(ISBLANK(C32),\" \",ROUND((C32)/C$26*100,0))))","v":"  "},null,{"$f":"IF(ISBLANK(E$26),\"  \",IF(ISBLANK(E$27),\" \",IF(ISBLANK(E32),\" \",ROUND((E32)/E$26*100,0))))","v":"  "},null,{"$f":"IF(ISBLANK(G$26),\"  \",IF(ISBLANK(G$27),\" \",IF(ISBLANK(G32),\" \",ROUND((G32)/G$26*100,0))))","v":"  "},null,{"$f":"IF(ISBLANK(I$26),\"  \",IF(ISBLANK(I$27),\" \",IF(ISBLANK(I32),\" \",ROUND((I32)/I$26*100,0))))","v":"  "},null,{"$f":"IF(ISBLANK(K$26),\"  \",IF(ISBLANK(K$27),\" \",IF(ISBLANK(K32),\" \",ROUND((K32)/K$26*100,0))))","v":"  "},null,{"$f":"IF(ISBLANK(M$26),\"  \",IF(ISBLANK(M$27),\" \",IF(ISBLANK(M32),\" \",ROUND((M32)/M$26*100,0))))","v":"  "}]
[{"$f":"'S1'!A33","v":"0-8"},{"$f":"'S1'!B33","v":100},null,{"$f":"IF(ISBLANK(C$26),\"  \",IF(ISBLANK(C$27),\" \",IF(ISBLANK(C33),\" \",ROUND((C33)/C$26*100,0))))","v":"  "},null,{"$f":"IF(ISBLANK(E$26),\"  \",IF(ISBLANK(E$27),\" \",IF(ISBLANK(E33),\" \",ROUND((E33)/E$26*100,0))))","v":"  "},null,{"$f":"IF(ISBLANK(G$26),\"  \",IF(ISBLANK(G$27),\" \",IF(ISBLANK(G33),\" \",ROUND((G33)/G$26*100,0))))","v":"  "},null,{"$f":"IF(ISBLANK(I$26),\"  \",IF(ISBLANK(I$27),\" \",IF(ISBLANK(I33),\" \",ROUND((I33)/I$26*100,0))))","v":"  "},null,{"$f":"IF(ISBLANK(K$26),\"  \",IF(ISBLANK(K$27),\" \",IF(ISBLANK(K33),\" \",ROUND((K33)/K$26*100,0))))","v":"  "},null,{"$f":"IF(ISBLANK(M$26),\"  \",IF(ISBLANK(M$27),\" \",IF(ISBLANK(M33),\" \",ROUND((M33)/M$26*100,0))))","v":"  "}]
["Tested By"]
["Remarks"]

{"sheet":"S8","index":7,"n_rows":35,"n_cols":14,"rows_kept":35,"cut":false,"hidden":true,"merged":[[34,12,37,13],[10,0,10,1],[9,0,9,1],[7,10,7,11],[7,12,7,13],[8,0,8,1],[8,2,8,3],[8,4,8,5],[8,6,8,7],[8,8,8,9],[8,10,8,11],[8,12,8,13],[17,2,17,3],[17,4,17,5],[18,0,21,1],[18,2,21,3],[5,3,5,8],[7,0,7,1],[7,2,7,3],[7,4,7,5],[7,6,7,7],[7,8,7,9],[3,10,3,11],[3,12,3,13],[0,0,3,1],[1,10,1,11],[1,12,1,13],[2,10,2,11],[2,12,2,13],[0,8,3,9],[1,2,1,7],[2,2,2,7],[3,2,3,7],[17,6,17,7],[34,0,37,1],[34,2,37,3],[34,4,37,5],[18,4,21,5],[18,6,21,7],[34,6,37,7],[24,6,24,7],[33,2,33,3],[33,4,33,5],[17,0,17,1],[17,12,17,13],[23,12,23,13],[33,8,33,9],[33,10,33,11],[23,8,23,9],[23,10,23,11],[18,8,21,9],[18,10,21,11],[18,12,21,13],[24,8,24,9],[24,10,24,11],[24,12,24,13],[33,12,33,13],[34,8,37,9],[34,10,37,11],[17,8,17,9],[17,10,17,11],[4,0,4,1],[25,0,25,1],[33,0,33,1],[26,0,26,1],[33,6,33,7],[23,0,23,1],[23,2,23,3],[23,4,23,5],[23,6,23,7],[24,0,24,1],[24,2,24,3],[24,4,24,5]]}
[]
[null,null,"COMMONWEALTH OF PENNSYLVANIA",null,null,null,null,null,null,null,"DISTRICT",null,{"$f":"IF(ISBLANK('S1'!L2),\" \",'S1'!L2)","v":" "}]
[null,null,"DEPARTMENT OF TRANSPORTATION",null,null,null,null,null,null,null,"PLANT CODE",null,{"$f":"IF(ISBLANK('S1'!L3),\" \",'S1'!L3)","v":" "}]
[null,null,"PENNSYLVANIA TURNPIKE COMMISSION",null,null,null,null,null,null,null,"AGG SIZE",null,{"$f":"IF(ISBLANK('S1'!L4),\" \",'S1'!L4)","v":"Type 2"}]
[{"$f":"'S1'!$A$5","v":"Aggregate 2023"}]
[null,null,null,{"$f":"'S1'!D6","v":"Material Test Results for Type 2 Anti-Skid"}]
[]
["Sample No."]
["Date"]
["Starting Weight",null,null,"% Loss",null,"% Loss",null,"% Loss",null,"% Loss",null,"% Loss",null,"% Loss"]
["Ending Weight",null,null,{"$f":"IF(ISBLANK(C10),\" \",IF(ISBLANK(C11),\" \",(C10-C11)/C10*100))","v":" "},null,{"$f":"IF(ISBLANK(E10),\" \",IF(ISBLANK(E11),\" \",(E10-E11)/E10*100))","v":" "},null,{"$f":"IF(ISBLANK(G10),\" \",IF(ISBLANK(G11),\" \",(G10-G11)/G10*100))","v":" "},null,{"$f":"IF(ISBLANK(I10),\" \",IF(ISBLANK(I11),\" \",(I10-I11)/I10*100))","v":" "},null,{"$f":"IF(ISBLANK(K10),\" \",IF(ISBLANK(K11),\" \",(K10-K11)/K10*100))","v":" "},null,{"$f":"IF(ISBLANK(M10),\" \",IF(ISBLANK(M11),\" \",(M10-M11)/M10*100))","v":" "}]
["Spec","Sieve","Wt","% Passing","Wt","% Passing","Wt","% Passing","Wt","% Passing","Wt","% Passing","Wt","% Passing"]
[{"$f":"'S1'!A13","v":"100"},{"$f":"'S1'!B13","v":0.5},null,{"$f":"IF(ISBLANK(C$10),\"  \",IF(ISBLANK(C$11),\" \",IF(ISBLANK(C13),\" \",ROUND((C13)/C$10*100,1))))","v":"  "},null,{"$f":"IF(ISBLANK(E$10),\"  \",IF(ISBLANK(E$11),\" \",IF(ISBLANK(E13),\" \",ROUND((E13)/E$10*100,1))))","v":"  "},null,{"$f":"IF(ISBLANK(G$10),\"  \",IF(ISBLANK(G$11),\" \",IF(ISBLANK(G13),\" \",ROUND((G13)/G$10*100,1))))","v":"  "},null,{"$f":"IF(ISBLANK(I$10),\"  \",IF(ISBLANK(I$11),\" \",IF(ISBLANK(I13),\" \",ROUND((I13)/I$10*100,1))))","v":"  "},null,{"$f":"IF(ISBLANK(K$10),\"  \",IF(ISBLANK(K$11),\" \",IF(ISBLANK(K13),\" \",ROUND((K13)/K$10*100,1))))","v":"  "},null,{"$f":"IF(ISBLANK(M$10),\"  \",IF(ISBLANK(M$11),\" \",IF(ISBLANK(M13),\" \",ROUND((M13)/M$10*100,1))))","v":"  "}]
[{"$f":"'S1'!A14","v":"95-100"},{"$f":"'S1'!B14","v":0.375},null,{"$f":"IF(ISBLANK(C$10),\"  \",IF(ISBLANK(C$11),\" \",IF(ISBLANK(C14),\" \",ROUND((C14)/C$10*100,0))))","v":"  "},null,{"$f":"IF(ISBLANK(E$10),\"  \",IF(ISBLANK(E$11),\" \",IF(ISBLANK(E14),\" \",ROUND((E14)/E$10*100,0))))","v":"  "},null,{"$f":"IF(ISBLANK(G$10),\"  \",IF(ISBLANK(G$11),\" \",IF(ISBLANK(G14),\" \",ROUND((G14)/G$10*100,0))))","v":"  "},null,{"$f":"IF(ISBLANK(I$10),\"  \",IF(ISBLANK(I$11),\" \",IF(ISBLANK(I14),\" \",ROUND((I14)/I$10*100,0))))","v":"  "},null,{"$f":"IF(ISBLANK(K$10),\"  \",IF(ISBLANK(K$11),\" \",IF(ISBLANK(K14),\" \",ROUND((K14)/K$10*100,0))))","v":"  "},null,{"$f":"IF(ISBLANK(M$10),\"  \",IF(ISBLANK(M$11),\" \",IF(ISBLANK(M14),\" \",ROUND((M14)/M$10*100,0))))","v":"  "}]
[{"$f":"'S1'!A15","v":"Breaker"},{"$f":"'S1'!B15","v":4},null,{"$f":"IF(ISBLANK(C$10),\"  \",IF(ISBLANK(C$11),\" \",IF(ISBLANK(C15),\" \",ROUND((C15)/C$10*100,0))))","v":"  "},null,{"$f":"IF(ISBLANK(E$10),\"  \",IF(ISBLANK(E$11),\" \",IF(ISBLANK(E15),\" \",ROUND((E15)/E$10*100,0))))","v":"  "},null,{"$f":"IF(ISBLANK(G$10),\"  \",IF(ISBLANK(G$11),\" \",IF(ISBLANK(G15),\" \",ROUND((G15)/G$10*100,0))))","v":"  "},null,{"$f":"IF(ISBLANK(I$10),\"  \",IF(ISBLANK(I$11),\" \",IF(ISBLANK(I15),\" \",ROUND((I15)/I$10*100,0))))","v":"  "},null,{"$f":"IF(ISBLANK(K$10),\"  \",IF(ISBLANK(K$11),\" \",IF(ISBLANK(K15),\" \",ROUND((K15)/K$10*100,0))))","v":"  "},null,{"$f":"IF(ISBLANK(M$10),\"  \",IF(ISBLANK(M$11),\" \",IF(ISBLANK(M15),\" \",ROUND((M15)/M$10*100,0))))","v":"  "}]
[{"$f":"'S1'!A16","v":"0-30"},{"$f":"'S1'!B16","v":8},null,{"$f":"IF(ISBLANK(C$10),\"  \",IF(ISBLANK(C$11),\" \",IF(ISBLANK(C16),\" \",ROUND((C16)/C$10*100,0))))","v":"  "},null,{"$f":"IF(ISBLANK(E$10),\"  \",IF(ISBLANK(E$11),\" \",IF(ISBLANK(E16),\" \",ROUND((E16)/E$10*100,0))))","v":"  "},null,{"$f":"IF(ISBLANK(G$10),\"  \",IF(ISBLANK(G$11),\" \",IF(ISBLANK(G16),\" \",ROUND((G16)/G$10*100,0))))","v":"  "},null,{"$f":"IF(ISBLANK(I$10),\"  \",IF(ISBLANK(I$11),\" \",IF(ISBLANK(I16),\" \",ROUND((I16)/I$10*100,0))))","v":"  "},null,{"$f":"IF(ISBLANK(K$10),\"  \",IF(ISBLANK(K$11),\" \",IF(ISBLANK(K16),\" \",ROUND((K16)/K$10*100,0))))","v":"  "},null,{"$f":"IF(ISBLANK(M$10),\"  \",IF(ISBLANK(M$11),\" \",IF(ISBLANK(M16),\" \",ROUND((M16)/M$10*100,0))))","v":"  "}]
[{"$f":"'S1'!A17","v":"0-8"},{"$f":"'S1'!B17","v":100},null,{"$f":"IF(ISBLANK(C$10),\"  \",IF(ISBLANK(C$11),\" \",IF(ISBLANK(C17),\" \",ROUND((C17)/C$10*100,0))))","v":"  "},null,{"$f":"IF(ISBLANK(E$10),\"  \",IF(ISBLANK(E$11),\" \",IF(ISBLANK(E17),\" \",ROUND((E17)/E$10*100,0))))","v":"  "},null,{"$f":"IF(ISBLANK(G$10),\"  \",IF(ISBLANK(G$11),\" \",IF(ISBLANK(G17),\" \",ROUND((G17)/G$10*100,0))))","v":"  "},null,{"$f":"IF(ISBLANK(I$10),\"  \",IF(ISBLANK(I$11),\" \",IF(ISBLANK(I17),\" \",ROUND((I17)/I$10*100,0))))","v":"  "},null,{"$f":"IF(ISBLANK(K$10),\"  \",IF(ISBLANK(K$11),\" \",IF(ISBLANK(K17),\" \",ROUND((K17)/K$10*100,0))))","v":"  "},null,{"$f":"IF(ISBLANK(M$10),\"  \",IF(ISBLANK(M$11),\" \",IF(ISBLANK(M17),\" \",ROUND((M17)/M$10*100,0))))","v":"  "}]
["Tested By"]
["Remarks"]
[]
[]
[]
[]
["Sample No."]
["Date"]
["Starting Weight",null,null,"% Loss",null,"% Loss",null,"% Loss",null,"% Loss",null,"% Loss",null,"% Loss"]
["Ending Weight",null,null,{"$f":"IF(ISBLANK(C26),\" \",IF(ISBLANK(C27),\" \",(C26-C27)/C26*100))","v":" "},null,{"$f":"IF(ISBLANK(E26),\" \",IF(ISBLANK(E27),\" \",(E26-E27)/E26*100))","v":" "},null,{"$f":"IF(ISBLANK(G26),\" \",IF(ISBLANK(G27),\" \",(G26-G27)/G26*100))","v":" "},null,{"$f":"IF(ISBLANK(I26),\" \",IF(ISBLANK(I27),\" \",(I26-I27)/I26*100))","v":" "},null,{"$f":"IF(ISBLANK(K26),\" \",IF(ISBLANK(K27),\" \",(K26-K27)/K26*100))","v":" "},null,{"$f":"IF(ISBLANK(M26),\" \",IF(ISBLANK(M27),\" \",(M26-M27)/M26*100))","v":" "}]
["Spec","Sieve","Wt","% Passing","Wt","% Passing","Wt","% Passing","Wt","% Passing","Wt","% Passing","Wt","% Passing"]
[{"$f":"'S1'!A29","v":"100"},{"$f":"'S1'!B29","v":0.5},null,{"$f":"IF(ISBLANK(C$26),\"  \",IF(ISBLANK(C$27),\" \",IF(ISBLANK(C29),\" \",ROUND((C29)/C$26*100,1))))","v":"  "},null,{"$f":"IF(ISBLANK(E$26),\"  \",IF(ISBLANK(E$27),\" \",IF(ISBLANK(E29),\" \",ROUND((E29)/E$26*100,1))))","v":"  "},null,{"$f":"IF(ISBLANK(G$26),\"  \",IF(ISBLANK(G$27),\" \",IF(ISBLANK(G29),\" \",ROUND((G29)/G$26*100,1))))","v":"  "},null,{"$f":"IF(ISBLANK(I$26),\"  \",IF(ISBLANK(I$27),\" \",IF(ISBLANK(I29),\" \",ROUND((I29)/I$26*100,1))))","v":"  "},null,{"$f":"IF(ISBLANK(K$26),\"  \",IF(ISBLANK(K$27),\" \",IF(ISBLANK(K29),\" \",ROUND((K29)/K$26*100,1))))","v":"  "},null,{"$f":"IF(ISBLANK(M$26),\"  \",IF(ISBLANK(M$27),\" \",IF(ISBLANK(M29),\" \",ROUND((M29)/M$26*100,1))))","v":"  "}]
[{"$f":"'S1'!A30","v":"95-100"},{"$f":"'S1'!B30","v":0.375},null,{"$f":"IF(ISBLANK(C$26),\"  \",IF(ISBLANK(C$27),\" \",IF(ISBLANK(C30),\" \",ROUND((C30)/C$26*100,0))))","v":"  "},null,{"$f":"IF(ISBLANK(E$26),\"  \",IF(ISBLANK(E$27),\" \",IF(ISBLANK(E30),\" \",ROUND((E30)/E$26*100,0))))","v":"  "},null,{"$f":"IF(ISBLANK(G$26),\"  \",IF(ISBLANK(G$27),\" \",IF(ISBLANK(G30),\" \",ROUND((G30)/G$26*100,0))))","v":"  "},null,{"$f":"IF(ISBLANK(I$26),\"  \",IF(ISBLANK(I$27),\" \",IF(ISBLANK(I30),\" \",ROUND((I30)/I$26*100,0))))","v":"  "},null,{"$f":"IF(ISBLANK(K$26),\"  \",IF(ISBLANK(K$27),\" \",IF(ISBLANK(K30),\" \",ROUND((K30)/K$26*100,0))))","v":"  "},null,{"$f":"IF(ISBLANK(M$26),\"  \",IF(ISBLANK(M$27),\" \",IF(ISBLANK(M30),\" \",ROUND((M30)/M$26*100,0))))","v":"  "}]
[{"$f":"'S1'!A31","v":"Breaker"},{"$f":"'S1'!B31","v":4},null,{"$f":"IF(ISBLANK(C$26),\"  \",IF(ISBLANK(C$27),\" \",IF(ISBLANK(C31),\" \",ROUND((C31)/C$26*100,0))))","v":"  "},null,{"$f":"IF(ISBLANK(E$26),\"  \",IF(ISBLANK(E$27),\" \",IF(ISBLANK(E31),\" \",ROUND((E31)/E$26*100,0))))","v":"  "},null,{"$f":"IF(ISBLANK(G$26),\"  \",IF(ISBLANK(G$27),\" \",IF(ISBLANK(G31),\" \",ROUND((G31)/G$26*100,0))))","v":"  "},null,{"$f":"IF(ISBLANK(I$26),\"  \",IF(ISBLANK(I$27),\" \",IF(ISBLANK(I31),\" \",ROUND((I31)/I$26*100,0))))","v":"  "},null,{"$f":"IF(ISBLANK(K$26),\"  \",IF(ISBLANK(K$27),\" \",IF(ISBLANK(K31),\" \",ROUND((K31)/K$26*100,0))))","v":"  "},null,{"$f":"IF(ISBLANK(M$26),\"  \",IF(ISBLANK(M$27),\" \",IF(ISBLANK(M31),\" \",ROUND((M31)/M$26*100,0))))","v":"  "}]
[{"$f":"'S1'!A32","v":"0-30"},{"$f":"'S1'!B32","v":8},null,{"$f":"IF(ISBLANK(C$26),\"  \",IF(ISBLANK(C$27),\" \",IF(ISBLANK(C32),\" \",ROUND((C32)/C$26*100,0))))","v":"  "},null,{"$f":"IF(ISBLANK(E$26),\"  \",IF(ISBLANK(E$27),\" \",IF(ISBLANK(E32),\" \",ROUND((E32)/E$26*100,0))))","v":"  "},null,{"$f":"IF(ISBLANK(G$26),\"  \",IF(ISBLANK(G$27),\" \",IF(ISBLANK(G32),\" \",ROUND((G32)/G$26*100,0))))","v":"  "},null,{"$f":"IF(ISBLANK(I$26),\"  \",IF(ISBLANK(I$27),\" \",IF(ISBLANK(I32),\" \",ROUND((I32)/I$26*100,0))))","v":"  "},null,{"$f":"IF(ISBLANK(K$26),\"  \",IF(ISBLANK(K$27),\" \",IF(ISBLANK(K32),\" \",ROUND((K32)/K$26*100,0))))","v":"  "},null,{"$f":"IF(ISBLANK(M$26),\"  \",IF(ISBLANK(M$27),\" \",IF(ISBLANK(M32),\" \",ROUND((M32)/M$26*100,0))))","v":"  "}]
[{"$f":"'S1'!A33","v":"0-8"},{"$f":"'S1'!B33","v":100},null,{"$f":"IF(ISBLANK(C$26),\"  \",IF(ISBLANK(C$27),\" \",IF(ISBLANK(C33),\" \",ROUND((C33)/C$26*100,0))))","v":"  "},null,{"$f":"IF(ISBLANK(E$26),\"  \",IF(ISBLANK(E$27),\" \",IF(ISBLANK(E33),\" \",ROUND((E33)/E$26*100,0))))","v":"  "},null,{"$f":"IF(ISBLANK(G$26),\"  \",IF(ISBLANK(G$27),\" \",IF(ISBLANK(G33),\" \",ROUND((G33)/G$26*100,0))))","v":"  "},null,{"$f":"IF(ISBLANK(I$26),\"  \",IF(ISBLANK(I$27),\" \",IF(ISBLANK(I33),\" \",ROUND((I33)/I$26*100,0))))","v":"  "},null,{"$f":"IF(ISBLANK(K$26),\"  \",IF(ISBLANK(K$27),\" \",IF(ISBLANK(K33),\" \",ROUND((K33)/K$26*100,0))))","v":"  "},null,{"$f":"IF(ISBLANK(M$26),\"  \",IF(ISBLANK(M$27),\" \",IF(ISBLANK(M33),\" \",ROUND((M33)/M$26*100,0))))","v":"  "}]
["Tested By"]
["Remarks"]

{"sheet":"S9","index":8,"n_rows":35,"n_cols":14,"rows_kept":35,"cut":false,"hidden":true,"merged":[[34,12,37,13],[10,0,10,1],[9,0,9,1],[7,10,7,11],[7,12,7,13],[8,0,8,1],[8,2,8,3],[8,4,8,5],[8,6,8,7],[8,8,8,9],[8,10,8,11],[8,12,8,13],[17,2,17,3],[17,4,17,5],[18,0,21,1],[18,2,21,3],[5,3,5,8],[7,0,7,1],[7,2,7,3],[7,4,7,5],[7,6,7,7],[7,8,7,9],[3,10,3,11],[3,12,3,13],[0,0,3,1],[1,10,1,11],[1,12,1,13],[2,10,2,11],[2,12,2,13],[0,8,3,9],[1,2,1,7],[2,2,2,7],[3,2,3,7],[17,6,17,7],[34,0,37,1],[34,2,37,3],[34,4,37,5],[18,4,21,5],[18,6,21,7],[34,6,37,7],[24,6,24,7],[33,2,33,3],[33,4,33,5],[17,0,17,1],[17,12,17,13],[23,12,23,13],[33,8,33,9],[33,10,33,11],[23,8,23,9],[23,10,23,11],[18,8,21,9],[18,10,21,11],[18,12,21,13],[24,8,24,9],[24,10,24,11],[24,12,24,13],[33,12,33,13],[34,8,37,9],[34,10,37,11],[17,8,17,9],[17,10,17,11],[4,0,4,1],[25,0,25,1],[33,0,33,1],[26,0,26,1],[33,6,33,7],[23,0,23,1],[23,2,23,3],[23,4,23,5],[23,6,23,7],[24,0,24,1],[24,2,24,3],[24,4,24,5]]}
[]
[null,null,"COMMONWEALTH OF PENNSYLVANIA",null,null,null,null,null,null,null,"DISTRICT",null,{"$f":"IF(ISBLANK('S1'!L2),\" \",'S1'!L2)","v":" "}]
[null,null,"DEPARTMENT OF TRANSPORTATION",null,null,null,null,null,null,null,"PLANT CODE",null,{"$f":"IF(ISBLANK('S1'!L3),\" \",'S1'!L3)","v":" "}]
[null,null,"PENNSYLVANIA TURNPIKE COMMISSION",null,null,null,null,null,null,null,"AGG SIZE",null,{"$f":"IF(ISBLANK('S1'!L4),\" \",'S1'!L4)","v":"Type 2"}]
[{"$f":"'S1'!$A$5","v":"Aggregate 2023"}]
[null,null,null,{"$f":"'S1'!D6","v":"Material Test Results for Type 2 Anti-Skid"}]
[]
["Sample No."]
["Date"]
["Starting Weight",null,null,"% Loss",null,"% Loss",null,"% Loss",null,"% Loss",null,"% Loss",null,"% Loss"]
["Ending Weight",null,null,{"$f":"IF(ISBLANK(C10),\" \",IF(ISBLANK(C11),\" \",(C10-C11)/C10*100))","v":" "},null,{"$f":"IF(ISBLANK(E10),\" \",IF(ISBLANK(E11),\" \",(E10-E11)/E10*100))","v":" "},null,{"$f":"IF(ISBLANK(G10),\" \",IF(ISBLANK(G11),\" \",(G10-G11)/G10*100))","v":" "},null,{"$f":"IF(ISBLANK(I10),\" \",IF(ISBLANK(I11),\" \",(I10-I11)/I10*100))","v":" "},null,{"$f":"IF(ISBLANK(K10),\" \",IF(ISBLANK(K11),\" \",(K10-K11)/K10*100))","v":" "},null,{"$f":"IF(ISBLANK(M10),\" \",IF(ISBLANK(M11),\" \",(M10-M11)/M10*100))","v":" "}]
["Spec","Sieve","Wt","% Passing","Wt","% Passing","Wt","% Passing","Wt","% Passing","Wt","% Passing","Wt","% Passing"]
[{"$f":"'S1'!A13","v":"100"},{"$f":"'S1'!B13","v":0.5},null,{"$f":"IF(ISBLANK(C$10),\"  \",IF(ISBLANK(C$11),\" \",IF(ISBLANK(C13),\" \",ROUND((C13)/C$10*100,1))))","v":"  "},null,{"$f":"IF(ISBLANK(E$10),\"  \",IF(ISBLANK(E$11),\" \",IF(ISBLANK(E13),\" \",ROUND((E13)/E$10*100,1))))","v":"  "},null,{"$f":"IF(ISBLANK(G$10),\"  \",IF(ISBLANK(G$11),\" \",IF(ISBLANK(G13),\" \",ROUND((G13)/G$10*100,1))))","v":"  "},null,{"$f":"IF(ISBLANK(I$10),\"  \",IF(ISBLANK(I$11),\" \",IF(ISBLANK(I13),\" \",ROUND((I13)/I$10*100,1))))","v":"  "},null,{"$f":"IF(ISBLANK(K$10),\"  \",IF(ISBLANK(K$11),\" \",IF(ISBLANK(K13),\" \",ROUND((K13)/K$10*100,1))))","v":"  "},null,{"$f":"IF(ISBLANK(M$10),\"  \",IF(ISBLANK(M$11),\" \",IF(ISBLANK(M13),\" \",ROUND((M13)/M$10*100,1))))","v":"  "}]
[{"$f":"'S1'!A14","v":"95-100"},{"$f":"'S1'!B14","v":0.375},null,{"$f":"IF(ISBLANK(C$10),\"  \",IF(ISBLANK(C$11),\" \",IF(ISBLANK(C14),\" \",ROUND((C14)/C$10*100,0))))","v":"  "},null,{"$f":"IF(ISBLANK(E$10),\"  \",IF(ISBLANK(E$11),\" \",IF(ISBLANK(E14),\" \",ROUND((E14)/E$10*100,0))))","v":"  "},null,{"$f":"IF(ISBLANK(G$10),\"  \",IF(ISBLANK(G$11),\" \",IF(ISBLANK(G14),\" \",ROUND((G14)/G$10*100,0))))","v":"  "},null,{"$f":"IF(ISBLANK(I$10),\"  \",IF(ISBLANK(I$11),\" \",IF(ISBLANK(I14),\" \",ROUND((I14)/I$10*100,0))))","v":"  "},null,{"$f":"IF(ISBLANK(K$10),\"  \",IF(ISBLANK(K$11),\" \",IF(ISBLANK(K14),\" \",ROUND((K14)/K$10*100,0))))","v":"  "},null,{"$f":"IF(ISBLANK(M$10),\"  \",IF(ISBLANK(M$11),\" \",IF(ISBLANK(M14),\" \",ROUND((M14)/M$10*100,0))))","v":"  "}]
[{"$f":"'S1'!A15","v":"Breaker"},{"$f":"'S1'!B15","v":4},null,{"$f":"IF(ISBLANK(C$10),\"  \",IF(ISBLANK(C$11),\" \",IF(ISBLANK(C15),\" \",ROUND((C15)/C$10*100,0))))","v":"  "},null,{"$f":"IF(ISBLANK(E$10),\"  \",IF(ISBLANK(E$11),\" \",IF(ISBLANK(E15),\" \",ROUND((E15)/E$10*100,0))))","v":"  "},null,{"$f":"IF(ISBLANK(G$10),\"  \",IF(ISBLANK(G$11),\" \",IF(ISBLANK(G15),\" \",ROUND((G15)/G$10*100,0))))","v":"  "},null,{"$f":"IF(ISBLANK(I$10),\"  \",IF(ISBLANK(I$11),\" \",IF(ISBLANK(I15),\" \",ROUND((I15)/I$10*100,0))))","v":"  "},null,{"$f":"IF(ISBLANK(K$10),\"  \",IF(ISBLANK(K$11),\" \",IF(ISBLANK(K15),\" \",ROUND((K15)/K$10*100,0))))","v":"  "},null,{"$f":"IF(ISBLANK(M$10),\"  \",IF(ISBLANK(M$11),\" \",IF(ISBLANK(M15),\" \",ROUND((M15)/M$10*100,0))))","v":"  "}]
[{"$f":"'S1'!A16","v":"0-30"},{"$f":"'S1'!B16","v":8},null,{"$f":"IF(ISBLANK(C$10),\"  \",IF(ISBLANK(C$11),\" \",IF(ISBLANK(C16),\" \",ROUND((C16)/C$10*100,0))))","v":"  "},null,{"$f":"IF(ISBLANK(E$10),\"  \",IF(ISBLANK(E$11),\" \",IF(ISBLANK(E16),\" \",ROUND((E16)/E$10*100,0))))","v":"  "},null,{"$f":"IF(ISBLANK(G$10),\"  \",IF(ISBLANK(G$11),\" \",IF(ISBLANK(G16),\" \",ROUND((G16)/G$10*100,0))))","v":"  "},null,{"$f":"IF(ISBLANK(I$10),\"  \",IF(ISBLANK(I$11),\" \",IF(ISBLANK(I16),\" \",ROUND((I16)/I$10*100,0))))","v":"  "},null,{"$f":"IF(ISBLANK(K$10),\"  \",IF(ISBLANK(K$11),\" \",IF(ISBLANK(K16),\" \",ROUND((K16)/K$10*100,0))))","v":"  "},null,{"$f":"IF(ISBLANK(M$10),\"  \",IF(ISBLANK(M$11),\" \",IF(ISBLANK(M16),\" \",ROUND((M16)/M$10*100,0))))","v":"  "}]
[{"$f":"'S1'!A17","v":"0-8"},{"$f":"'S1'!B17","v":100},null,{"$f":"IF(ISBLANK(C$10),\"  \",IF(ISBLANK(C$11),\" \",IF(ISBLANK(C17),\" \",ROUND((C17)/C$10*100,0))))","v":"  "},null,{"$f":"IF(ISBLANK(E$10),\"  \",IF(ISBLANK(E$11),\" \",IF(ISBLANK(E17),\" \",ROUND((E17)/E$10*100,0))))","v":"  "},null,{"$f":"IF(ISBLANK(G$10),\"  \",IF(ISBLANK(G$11),\" \",IF(ISBLANK(G17),\" \",ROUND((G17)/G$10*100,0))))","v":"  "},null,{"$f":"IF(ISBLANK(I$10),\"  \",IF(ISBLANK(I$11),\" \",IF(ISBLANK(I17),\" \",ROUND((I17)/I$10*100,0))))","v":"  "},null,{"$f":"IF(ISBLANK(K$10),\"  \",IF(ISBLANK(K$11),\" \",IF(ISBLANK(K17),\" \",ROUND((K17)/K$10*100,0))))","v":"  "},null,{"$f":"IF(ISBLANK(M$10),\"  \",IF(ISBLANK(M$11),\" \",IF(ISBLANK(M17),\" \",ROUND((M17)/M$10*100,0))))","v":"  "}]
["Tested By"]
["Remarks"]
[]
[]
[]
[]
["Sample No."]
["Date"]
["Starting Weight",null,null,"% Loss",null,"% Loss",null,"% Loss",null,"% Loss",null,"% Loss",null,"% Loss"]
["Ending Weight",null,null,{"$f":"IF(ISBLANK(C26),\" \",IF(ISBLANK(C27),\" \",(C26-C27)/C26*100))","v":" "},null,{"$f":"IF(ISBLANK(E26),\" \",IF(ISBLANK(E27),\" \",(E26-E27)/E26*100))","v":" "},null,{"$f":"IF(ISBLANK(G26),\" \",IF(ISBLANK(G27),\" \",(G26-G27)/G26*100))","v":" "},null,{"$f":"IF(ISBLANK(I26),\" \",IF(ISBLANK(I27),\" \",(I26-I27)/I26*100))","v":" "},null,{"$f":"IF(ISBLANK(K26),\" \",IF(ISBLANK(K27),\" \",(K26-K27)/K26*100))","v":" "},null,{"$f":"IF(ISBLANK(M26),\" \",IF(ISBLANK(M27),\" \",(M26-M27)/M26*100))","v":" "}]
["Spec","Sieve","Wt","% Passing","Wt","% Passing","Wt","% Passing","Wt","% Passing","Wt","% Passing","Wt","% Passing"]
[{"$f":"'S1'!A29","v":"100"},{"$f":"'S1'!B29","v":0.5},null,{"$f":"IF(ISBLANK(C$26),\"  \",IF(ISBLANK(C$27),\" \",IF(ISBLANK(C29),\" \",ROUND((C29)/C$26*100,1))))","v":"  "},null,{"$f":"IF(ISBLANK(E$26),\"  \",IF(ISBLANK(E$27),\" \",IF(ISBLANK(E29),\" \",ROUND((E29)/E$26*100,1))))","v":"  "},null,{"$f":"IF(ISBLANK(G$26),\"  \",IF(ISBLANK(G$27),\" \",IF(ISBLANK(G29),\" \",ROUND((G29)/G$26*100,1))))","v":"  "},null,{"$f":"IF(ISBLANK(I$26),\"  \",IF(ISBLANK(I$27),\" \",IF(ISBLANK(I29),\" \",ROUND((I29)/I$26*100,1))))","v":"  "},null,{"$f":"IF(ISBLANK(K$26),\"  \",IF(ISBLANK(K$27),\" \",IF(ISBLANK(K29),\" \",ROUND((K29)/K$26*100,1))))","v":"  "},null,{"$f":"IF(ISBLANK(M$26),\"  \",IF(ISBLANK(M$27),\" \",IF(ISBLANK(M29),\" \",ROUND((M29)/M$26*100,1))))","v":"  "}]
[{"$f":"'S1'!A30","v":"95-100"},{"$f":"'S1'!B30","v":0.375},null,{"$f":"IF(ISBLANK(C$26),\"  \",IF(ISBLANK(C$27),\" \",IF(ISBLANK(C30),\" \",ROUND((C30)/C$26*100,0))))","v":"  "},null,{"$f":"IF(ISBLANK(E$26),\"  \",IF(ISBLANK(E$27),\" \",IF(ISBLANK(E30),\" \",ROUND((E30)/E$26*100,0))))","v":"  "},null,{"$f":"IF(ISBLANK(G$26),\"  \",IF(ISBLANK(G$27),\" \",IF(ISBLANK(G30),\" \",ROUND((G30)/G$26*100,0))))","v":"  "},null,{"$f":"IF(ISBLANK(I$26),\"  \",IF(ISBLANK(I$27),\" \",IF(ISBLANK(I30),\" \",ROUND((I30)/I$26*100,0))))","v":"  "},null,{"$f":"IF(ISBLANK(K$26),\"  \",IF(ISBLANK(K$27),\" \",IF(ISBLANK(K30),\" \",ROUND((K30)/K$26*100,0))))","v":"  "},null,{"$f":"IF(ISBLANK(M$26),\"  \",IF(ISBLANK(M$27),\" \",IF(ISBLANK(M30),\" \",ROUND((M30)/M$26*100,0))))","v":"  "}]
[{"$f":"'S1'!A31","v":"Breaker"},{"$f":"'S1'!B31","v":4},null,{"$f":"IF(ISBLANK(C$26),\"  \",IF(ISBLANK(C$27),\" \",IF(ISBLANK(C31),\" \",ROUND((C31)/C$26*100,0))))","v":"  "},null,{"$f":"IF(ISBLANK(E$26),\"  \",IF(ISBLANK(E$27),\" \",IF(ISBLANK(E31),\" \",ROUND((E31)/E$26*100,0))))","v":"  "},null,{"$f":"IF(ISBLANK(G$26),\"  \",IF(ISBLANK(G$27),\" \",IF(ISBLANK(G31),\" \",ROUND((G31)/G$26*100,0))))","v":"  "},null,{"$f":"IF(ISBLANK(I$26),\"  \",IF(ISBLANK(I$27),\" \",IF(ISBLANK(I31),\" \",ROUND((I31)/I$26*100,0))))","v":"  "},null,{"$f":"IF(ISBLANK(K$26),\"  \",IF(ISBLANK(K$27),\" \",IF(ISBLANK(K31),\" \",ROUND((K31)/K$26*100,0))))","v":"  "},null,{"$f":"IF(ISBLANK(M$26),\"  \",IF(ISBLANK(M$27),\" \",IF(ISBLANK(M31),\" \",ROUND((M31)/M$26*100,0))))","v":"  "}]
[{"$f":"'S1'!A32","v":"0-30"},{"$f":"'S1'!B32","v":8},null,{"$f":"IF(ISBLANK(C$26),\"  \",IF(ISBLANK(C$27),\" \",IF(ISBLANK(C32),\" \",ROUND((C32)/C$26*100,0))))","v":"  "},null,{"$f":"IF(ISBLANK(E$26),\"  \",IF(ISBLANK(E$27),\" \",IF(ISBLANK(E32),\" \",ROUND((E32)/E$26*100,0))))","v":"  "},null,{"$f":"IF(ISBLANK(G$26),\"  \",IF(ISBLANK(G$27),\" \",IF(ISBLANK(G32),\" \",ROUND((G32)/G$26*100,0))))","v":"  "},null,{"$f":"IF(ISBLANK(I$26),\"  \",IF(ISBLANK(I$27),\" \",IF(ISBLANK(I32),\" \",ROUND((I32)/I$26*100,0))))","v":"  "},null,{"$f":"IF(ISBLANK(K$26),\"  \",IF(ISBLANK(K$27),\" \",IF(ISBLANK(K32),\" \",ROUND((K32)/K$26*100,0))))","v":"  "},null,{"$f":"IF(ISBLANK(M$26),\"  \",IF(ISBLANK(M$27),\" \",IF(ISBLANK(M32),\" \",ROUND((M32)/M$26*100,0))))","v":"  "}]
[{"$f":"'S1'!A33","v":"0-8"},{"$f":"'S1'!B33","v":100},null,{"$f":"IF(ISBLANK(C$26),\"  \",IF(ISBLANK(C$27),\" \",IF(ISBLANK(C33),\" \",ROUND((C33)/C$26*100,0))))","v":"  "},null,{"$f":"IF(ISBLANK(E$26),\"  \",IF(ISBLANK(E$27),\" \",IF(ISBLANK(E33),\" \",ROUND((E33)/E$26*100,0))))","v":"  "},null,{"$f":"IF(ISBLANK(G$26),\"  \",IF(ISBLANK(G$27),\" \",IF(ISBLANK(G33),\" \",ROUND((G33)/G$26*100,0))))","v":"  "},null,{"$f":"IF(ISBLANK(I$26),\"  \",IF(ISBLANK(I$27),\" \",IF(ISBLANK(I33),\" \",ROUND((I33)/I$26*100,0))))","v":"  "},null,{"$f":"IF(ISBLANK(K$26),\"  \",IF(ISBLANK(K$27),\" \",IF(ISBLANK(K33),\" \",ROUND((K33)/K$26*100,0))))","v":"  "},null,{"$f":"IF(ISBLANK(M$26),\"  \",IF(ISBLANK(M$27),\" \",IF(ISBLANK(M33),\" \",ROUND((M33)/M$26*100,0))))","v":"  "}]
["Tested By"]
["Remarks"]

{"sheet":"S10","index":9,"n_rows":35,"n_cols":14,"rows_kept":35,"cut":false,"hidden":true,"merged":[[34,12,37,13],[10,0,10,1],[9,0,9,1],[7,10,7,11],[7,12,7,13],[8,0,8,1],[8,2,8,3],[8,4,8,5],[8,6,8,7],[8,8,8,9],[8,10,8,11],[8,12,8,13],[17,2,17,3],[17,4,17,5],[18,0,21,1],[18,2,21,3],[5,3,5,8],[7,0,7,1],[7,2,7,3],[7,4,7,5],[7,6,7,7],[7,8,7,9],[3,10,3,11],[3,12,3,13],[0,0,3,1],[1,10,1,11],[1,12,1,13],[2,10,2,11],[2,12,2,13],[0,8,3,9],[1,2,1,7],[2,2,2,7],[3,2,3,7],[17,6,17,7],[34,0,37,1],[34,2,37,3],[34,4,37,5],[18,4,21,5],[18,6,21,7],[34,6,37,7],[24,6,24,7],[33,2,33,3],[33,4,33,5],[17,0,17,1],[17,12,17,13],[23,12,23,13],[33,8,33,9],[33,10,33,11],[23,8,23,9],[23,10,23,11],[18,8,21,9],[18,10,21,11],[18,12,21,13],[24,8,24,9],[24,10,24,11],[24,12,24,13],[33,12,33,13],[34,8,37,9],[34,10,37,11],[17,8,17,9],[17,10,17,11],[4,0,4,1],[25,0,25,1],[33,0,33,1],[26,0,26,1],[33,6,33,7],[23,0,23,1],[23,2,23,3],[23,4,23,5],[23,6,23,7],[24,0,24,1],[24,2,24,3],[24,4,24,5]]}
[]
[null,null,"COMMONWEALTH OF PENNSYLVANIA",null,null,null,null,null,null,null,"DISTRICT",null,{"$f":"IF(ISBLANK('S1'!L2),\" \",'S1'!L2)","v":" "}]
[null,null,"DEPARTMENT OF TRANSPORTATION",null,null,null,null,null,null,null,"PLANT CODE",null,{"$f":"IF(ISBLANK('S1'!L3),\" \",'S1'!L3)","v":" "}]
[null,null,"PENNSYLVANIA TURNPIKE COMMISSION",null,null,null,null,null,null,null,"AGG SIZE",null,{"$f":"IF(ISBLANK('S1'!L4),\" \",'S1'!L4)","v":"Type 2"}]
[{"$f":"'S1'!$A$5","v":"Aggregate 2023"}]
[null,null,null,{"$f":"'S1'!D6","v":"Material Test Results for Type 2 Anti-Skid"}]
[]
["Sample No."]
["Date"]
["Starting Weight",null,null,"% Loss",null,"% Loss",null,"% Loss",null,"% Loss",null,"% Loss",null,"% Loss"]
["Ending Weight",null,null,{"$f":"IF(ISBLANK(C10),\" \",IF(ISBLANK(C11),\" \",(C10-C11)/C10*100))","v":" "},null,{"$f":"IF(ISBLANK(E10),\" \",IF(ISBLANK(E11),\" \",(E10-E11)/E10*100))","v":" "},null,{"$f":"IF(ISBLANK(G10),\" \",IF(ISBLANK(G11),\" \",(G10-G11)/G10*100))","v":" "},null,{"$f":"IF(ISBLANK(I10),\" \",IF(ISBLANK(I11),\" \",(I10-I11)/I10*100))","v":" "},null,{"$f":"IF(ISBLANK(K10),\" \",IF(ISBLANK(K11),\" \",(K10-K11)/K10*100))","v":" "},null,{"$f":"IF(ISBLANK(M10),\" \",IF(ISBLANK(M11),\" \",(M10-M11)/M10*100))","v":" "}]
["Spec","Sieve","Wt","% Passing","Wt","% Passing","Wt","% Passing","Wt","% Passing","Wt","% Passing","Wt","% Passing"]
[{"$f":"'S1'!A13","v":"100"},{"$f":"'S1'!B13","v":0.5},null,{"$f":"IF(ISBLANK(C$10),\"  \",IF(ISBLANK(C$11),\" \",IF(ISBLANK(C13),\" \",ROUND((C13)/C$10*100,1))))","v":"  "},null,{"$f":"IF(ISBLANK(E$10),\"  \",IF(ISBLANK(E$11),\" \",IF(ISBLANK(E13),\" \",ROUND((E13)/E$10*100,1))))","v":"  "},null,{"$f":"IF(ISBLANK(G$10),\"  \",IF(ISBLANK(G$11),\" \",IF(ISBLANK(G13),\" \",ROUND((G13)/G$10*100,1))))","v":"  "},null,{"$f":"IF(ISBLANK(I$10),\"  \",IF(ISBLANK(I$11),\" \",IF(ISBLANK(I13),\" \",ROUND((I13)/I$10*100,1))))","v":"  "},null,{"$f":"IF(ISBLANK(K$10),\"  \",IF(ISBLANK(K$11),\" \",IF(ISBLANK(K13),\" \",ROUND((K13)/K$10*100,1))))","v":"  "},null,{"$f":"IF(ISBLANK(M$10),\"  \",IF(ISBLANK(M$11),\" \",IF(ISBLANK(M13),\" \",ROUND((M13)/M$10*100,1))))","v":"  "}]
[{"$f":"'S1'!A14","v":"95-100"},{"$f":"'S1'!B14","v":0.375},null,{"$f":"IF(ISBLANK(C$10),\"  \",IF(ISBLANK(C$11),\" \",IF(ISBLANK(C14),\" \",ROUND((C14)/C$10*100,0))))","v":"  "},null,{"$f":"IF(ISBLANK(E$10),\"  \",IF(ISBLANK(E$11),\" \",IF(ISBLANK(E14),\" \",ROUND((E14)/E$10*100,0))))","v":"  "},null,{"$f":"IF(ISBLANK(G$10),\"  \",IF(ISBLANK(G$11),\" \",IF(ISBLANK(G14),\" \",ROUND((G14)/G$10*100,0))))","v":"  "},null,{"$f":"IF(ISBLANK(I$10),\"  \",IF(ISBLANK(I$11),\" \",IF(ISBLANK(I14),\" \",ROUND((I14)/I$10*100,0))))","v":"  "},null,{"$f":"IF(ISBLANK(K$10),\"  \",IF(ISBLANK(K$11),\" \",IF(ISBLANK(K14),\" \",ROUND((K14)/K$10*100,0))))","v":"  "},null,{"$f":"IF(ISBLANK(M$10),\"  \",IF(ISBLANK(M$11),\" \",IF(ISBLANK(M14),\" \",ROUND((M14)/M$10*100,0))))","v":"  "}]
[{"$f":"'S1'!A15","v":"Breaker"},{"$f":"'S1'!B15","v":4},null,{"$f":"IF(ISBLANK(C$10),\"  \",IF(ISBLANK(C$11),\" \",IF(ISBLANK(C15),\" \",ROUND((C15)/C$10*100,0))))","v":"  "},null,{"$f":"IF(ISBLANK(E$10),\"  \",IF(ISBLANK(E$11),\" \",IF(ISBLANK(E15),\" \",ROUND((E15)/E$10*100,0))))","v":"  "},null,{"$f":"IF(ISBLANK(G$10),\"  \",IF(ISBLANK(G$11),\" \",IF(ISBLANK(G15),\" \",ROUND((G15)/G$10*100,0))))","v":"  "},null,{"$f":"IF(ISBLANK(I$10),\"  \",IF(ISBLANK(I$11),\" \",IF(ISBLANK(I15),\" \",ROUND((I15)/I$10*100,0))))","v":"  "},null,{"$f":"IF(ISBLANK(K$10),\"  \",IF(ISBLANK(K$11),\" \",IF(ISBLANK(K15),\" \",ROUND((K15)/K$10*100,0))))","v":"  "},null,{"$f":"IF(ISBLANK(M$10),\"  \",IF(ISBLANK(M$11),\" \",IF(ISBLANK(M15),\" \",ROUND((M15)/M$10*100,0))))","v":"  "}]
[{"$f":"'S1'!A16","v":"0-30"},{"$f":"'S1'!B16","v":8},null,{"$f":"IF(ISBLANK(C$10),\"  \",IF(ISBLANK(C$11),\" \",IF(ISBLANK(C16),\" \",ROUND((C16)/C$10*100,0))))","v":"  "},null,{"$f":"IF(ISBLANK(E$10),\"  \",IF(ISBLANK(E$11),\" \",IF(ISBLANK(E16),\" \",ROUND((E16)/E$10*100,0))))","v":"  "},null,{"$f":"IF(ISBLANK(G$10),\"  \",IF(ISBLANK(G$11),\" \",IF(ISBLANK(G16),\" \",ROUND((G16)/G$10*100,0))))","v":"  "},null,{"$f":"IF(ISBLANK(I$10),\"  \",IF(ISBLANK(I$11),\" \",IF(ISBLANK(I16),\" \",ROUND((I16)/I$10*100,0))))","v":"  "},null,{"$f":"IF(ISBLANK(K$10),\"  \",IF(ISBLANK(K$11),\" \",IF(ISBLANK(K16),\" \",ROUND((K16)/K$10*100,0))))","v":"  "},null,{"$f":"IF(ISBLANK(M$10),\"  \",IF(ISBLANK(M$11),\" \",IF(ISBLANK(M16),\" \",ROUND((M16)/M$10*100,0))))","v":"  "}]
[{"$f":"'S1'!A17","v":"0-8"},{"$f":"'S1'!B17","v":100},null,{"$f":"IF(ISBLANK(C$10),\"  \",IF(ISBLANK(C$11),\" \",IF(ISBLANK(C17),\" \",ROUND((C17)/C$10*100,0))))","v":"  "},null,{"$f":"IF(ISBLANK(E$10),\"  \",IF(ISBLANK(E$11),\" \",IF(ISBLANK(E17),\" \",ROUND((E17)/E$10*100,0))))","v":"  "},null,{"$f":"IF(ISBLANK(G$10),\"  \",IF(ISBLANK(G$11),\" \",IF(ISBLANK(G17),\" \",ROUND((G17)/G$10*100,0))))","v":"  "},null,{"$f":"IF(ISBLANK(I$10),\"  \",IF(ISBLANK(I$11),\" \",IF(ISBLANK(I17),\" \",ROUND((I17)/I$10*100,0))))","v":"  "},null,{"$f":"IF(ISBLANK(K$10),\"  \",IF(ISBLANK(K$11),\" \",IF(ISBLANK(K17),\" \",ROUND((K17)/K$10*100,0))))","v":"  "},null,{"$f":"IF(ISBLANK(M$10),\"  \",IF(ISBLANK(M$11),\" \",IF(ISBLANK(M17),\" \",ROUND((M17)/M$10*100,0))))","v":"  "}]
["Tested By"]
["Remarks"]
[]
[]
[]
[]
["Sample No."]
["Date"]
["Starting Weight",null,null,"% Loss",null,"% Loss",null,"% Loss",null,"% Loss",null,"% Loss",null,"% Loss"]
["Ending Weight",null,null,{"$f":"IF(ISBLANK(C26),\" \",IF(ISBLANK(C27),\" \",(C26-C27)/C26*100))","v":" "},null,{"$f":"IF(ISBLANK(E26),\" \",IF(ISBLANK(E27),\" \",(E26-E27)/E26*100))","v":" "},null,{"$f":"IF(ISBLANK(G26),\" \",IF(ISBLANK(G27),\" \",(G26-G27)/G26*100))","v":" "},null,{"$f":"IF(ISBLANK(I26),\" \",IF(ISBLANK(I27),\" \",(I26-I27)/I26*100))","v":" "},null,{"$f":"IF(ISBLANK(K26),\" \",IF(ISBLANK(K27),\" \",(K26-K27)/K26*100))","v":" "},null,{"$f":"IF(ISBLANK(M26),\" \",IF(ISBLANK(M27),\" \",(M26-M27)/M26*100))","v":" "}]
["Spec","Sieve","Wt","% Passing","Wt","% Passing","Wt","% Passing","Wt","% Passing","Wt","% Passing","Wt","% Passing"]
[{"$f":"'S1'!A29","v":"100"},{"$f":"'S1'!B29","v":0.5},null,{"$f":"IF(ISBLANK(C$26),\"  \",IF(ISBLANK(C$27),\" \",IF(ISBLANK(C29),\" \",ROUND((C29)/C$26*100,1))))","v":"  "},null,{"$f":"IF(ISBLANK(E$26),\"  \",IF(ISBLANK(E$27),\" \",IF(ISBLANK(E29),\" \",ROUND((E29)/E$26*100,1))))","v":"  "},null,{"$f":"IF(ISBLANK(G$26),\"  \",IF(ISBLANK(G$27),\" \",IF(ISBLANK(G29),\" \",ROUND((G29)/G$26*100,1))))","v":"  "},null,{"$f":"IF(ISBLANK(I$26),\"  \",IF(ISBLANK(I$27),\" \",IF(ISBLANK(I29),\" \",ROUND((I29)/I$26*100,1))))","v":"  "},null,{"$f":"IF(ISBLANK(K$26),\"  \",IF(ISBLANK(K$27),\" \",IF(ISBLANK(K29),\" \",ROUND((K29)/K$26*100,1))))","v":"  "},null,{"$f":"IF(ISBLANK(M$26),\"  \",IF(ISBLANK(M$27),\" \",IF(ISBLANK(M29),\" \",ROUND((M29)/M$26*100,1))))","v":"  "}]
[{"$f":"'S1'!A30","v":"95-100"},{"$f":"'S1'!B30","v":0.375},null,{"$f":"IF(ISBLANK(C$26),\"  \",IF(ISBLANK(C$27),\" \",IF(ISBLANK(C30),\" \",ROUND((C30)/C$26*100,0))))","v":"  "},null,{"$f":"IF(ISBLANK(E$26),\"  \",IF(ISBLANK(E$27),\" \",IF(ISBLANK(E30),\" \",ROUND((E30)/E$26*100,0))))","v":"  "},null,{"$f":"IF(ISBLANK(G$26),\"  \",IF(ISBLANK(G$27),\" \",IF(ISBLANK(G30),\" \",ROUND((G30)/G$26*100,0))))","v":"  "},null,{"$f":"IF(ISBLANK(I$26),\"  \",IF(ISBLANK(I$27),\" \",IF(ISBLANK(I30),\" \",ROUND((I30)/I$26*100,0))))","v":"  "},null,{"$f":"IF(ISBLANK(K$26),\"  \",IF(ISBLANK(K$27),\" \",IF(ISBLANK(K30),\" \",ROUND((K30)/K$26*100,0))))","v":"  "},null,{"$f":"IF(ISBLANK(M$26),\"  \",IF(ISBLANK(M$27),\" \",IF(ISBLANK(M30),\" \",ROUND((M30)/M$26*100,0))))","v":"  "}]
[{"$f":"'S1'!A31","v":"Breaker"},{"$f":"'S1'!B31","v":4},null,{"$f":"IF(ISBLANK(C$26),\"  \",IF(ISBLANK(C$27),\" \",IF(ISBLANK(C31),\" \",ROUND((C31)/C$26*100,0))))","v":"  "},null,{"$f":"IF(ISBLANK(E$26),\"  \",IF(ISBLANK(E$27),\" \",IF(ISBLANK(E31),\" \",ROUND((E31)/E$26*100,0))))","v":"  "},null,{"$f":"IF(ISBLANK(G$26),\"  \",IF(ISBLANK(G$27),\" \",IF(ISBLANK(G31),\" \",ROUND((G31)/G$26*100,0))))","v":"  "},null,{"$f":"IF(ISBLANK(I$26),\"  \",IF(ISBLANK(I$27),\" \",IF(ISBLANK(I31),\" \",ROUND((I31)/I$26*100,0))))","v":"  "},null,{"$f":"IF(ISBLANK(K$26),\"  \",IF(ISBLANK(K$27),\" \",IF(ISBLANK(K31),\" \",ROUND((K31)/K$26*100,0))))","v":"  "},null,{"$f":"IF(ISBLANK(M$26),\"  \",IF(ISBLANK(M$27),\" \",IF(ISBLANK(M31),\" \",ROUND((M31)/M$26*100,0))))","v":"  "}]
[{"$f":"'S1'!A32","v":"0-30"},{"$f":"'S1'!B32","v":8},null,{"$f":"IF(ISBLANK(C$26),\"  \",IF(ISBLANK(C$27),\" \",IF(ISBLANK(C32),\" \",ROUND((C32)/C$26*100,0))))","v":"  "},null,{"$f":"IF(ISBLANK(E$26),\"  \",IF(ISBLANK(E$27),\" \",IF(ISBLANK(E32),\" \",ROUND((E32)/E$26*100,0))))","v":"  "},null,{"$f":"IF(ISBLANK(G$26),\"  \",IF(ISBLANK(G$27),\" \",IF(ISBLANK(G32),\" \",ROUND((G32)/G$26*100,0))))","v":"  "},null,{"$f":"IF(ISBLANK(I$26),\"  \",IF(ISBLANK(I$27),\" \",IF(ISBLANK(I32),\" \",ROUND((I32)/I$26*100,0))))","v":"  "},null,{"$f":"IF(ISBLANK(K$26),\"  \",IF(ISBLANK(K$27),\" \",IF(ISBLANK(K32),\" \",ROUND((K32)/K$26*100,0))))","v":"  "},null,{"$f":"IF(ISBLANK(M$26),\"  \",IF(ISBLANK(M$27),\" \",IF(ISBLANK(M32),\" \",ROUND((M32)/M$26*100,0))))","v":"  "}]
[{"$f":"'S1'!A33","v":"0-8"},{"$f":"'S1'!B33","v":100},null,{"$f":"IF(ISBLANK(C$26),\"  \",IF(ISBLANK(C$27),\" \",IF(ISBLANK(C33),\" \",ROUND((C33)/C$26*100,0))))","v":"  "},null,{"$f":"IF(ISBLANK(E$26),\"  \",IF(ISBLANK(E$27),\" \",IF(ISBLANK(E33),\" \",ROUND((E33)/E$26*100,0))))","v":"  "},null,{"$f":"IF(ISBLANK(G$26),\"  \",IF(ISBLANK(G$27),\" \",IF(ISBLANK(G33),\" \",ROUND((G33)/G$26*100,0))))","v":"  "},null,{"$f":"IF(ISBLANK(I$26),\"  \",IF(ISBLANK(I$27),\" \",IF(ISBLANK(I33),\" \",ROUND((I33)/I$26*100,0))))","v":"  "},null,{"$f":"IF(ISBLANK(K$26),\"  \",IF(ISBLANK(K$27),\" \",IF(ISBLANK(K33),\" \",ROUND((K33)/K$26*100,0))))","v":"  "},null,{"$f":"IF(ISBLANK(M$26),\"  \",IF(ISBLANK(M$27),\" \",IF(ISBLANK(M33),\" \",ROUND((M33)/M$26*100,0))))","v":"  "}]
["Tested By"]
["Remarks"]

{"sheet":"Chart 1-24","index":10,"n_rows":5,"n_cols":10,"rows_kept":5,"cut":false,"hidden":false,"merged":[[3,1,3,5],[3,7,3,8],[3,9,3,10],[4,0,4,1],[0,0,2,0],[1,1,1,5],[1,7,1,8],[1,9,1,10],[2,1,2,5],[2,7,2,8],[2,9,2,10]]}
[]
[null,"COMMONWEALTH OF PENNSYLVANIA",null,null,null,null,null,"DISTRICT",null,{"$f":"'S1'!L2","v":0}]
[null,"DEPARTMENT OF TRANSPORTATION",null,null,null,null,null,"PLANT CODE",null,{"$f":"'S1'!L3","v":0}]
[null,"PENNSYLVANIA TURNPIKE COMMISSION",null,null,null,null,null,"AGG SIZE",null,{"$f":"'S1'!L4","v":"Type 2"}]
[{"$f":"'S1'!$A$5","v":"Aggregate 2023"}]

{"sheet":"Chart 25-48","index":11,"n_rows":5,"n_cols":10,"rows_kept":5,"cut":false,"hidden":true,"merged":[[3,1,3,5],[3,7,3,8],[3,9,3,10],[4,0,4,1],[0,0,2,0],[1,1,1,5],[1,7,1,8],[1,9,1,10],[2,1,2,5],[2,7,2,8],[2,9,2,10]]}
[]
[null,"COMMONWEALTH OF PENNSYLVANIA",null,null,null,null,null,"DISTRICT",null,{"$f":"'S1'!L2","v":0}]
[null,"DEPARTMENT OF TRANSPORTATION",null,null,null,null,null,"PLANT CODE",null,{"$f":"'S1'!L3","v":0}]
[null,"PENNSYLVANIA TURNPIKE COMMISSION",null,null,null,null,null,"AGG SIZE",null,{"$f":"'S1'!L4","v":"Type 2"}]
[{"$f":"'S1'!$A$5","v":"Aggregate 2023"}]

{"sheet":"Chart 49-72","index":12,"n_rows":5,"n_cols":10,"rows_kept":5,"cut":false,"hidden":true,"merged":[[3,1,3,5],[3,7,3,8],[3,9,3,10],[4,0,4,1],[0,0,2,0],[1,1,1,5],[1,7,1,8],[1,9,1,10],[2,1,2,5],[2,7,2,8],[2,9,2,10]]}
[]
[null,"COMMONWEALTH OF PENNSYLVANIA",null,null,null,null,null,"DISTRICT",null,{"$f":"'S1'!L2","v":0}]
[null,"DEPARTMENT OF TRANSPORTATION",null,null,null,null,null,"PLANT CODE",null,{"$f":"'S1'!L3","v":0}]
[null,"PENNSYLVANIA TURNPIKE COMMISSION",null,null,null,null,null,"AGG SIZE",null,{"$f":"'S1'!L4","v":"Type 2"}]
[{"$f":"'S1'!$A$5","v":"Aggregate 2023"}]

{"sheet":"Chart 73-96","index":13,"n_rows":5,"n_cols":10,"rows_kept":5,"cut":false,"hidden":true,"merged":[[3,1,3,5],[3,7,3,8],[3,9,3,10],[4,0,4,1],[0,0,2,0],[1,1,1,5],[1,7,1,8],[1,9,1,10],[2,1,2,5],[2,7,2,8],[2,9,2,10]]}
[]
[null,"COMMONWEALTH OF PENNSYLVANIA",null,null,null,null,null,"DISTRICT",null,{"$f":"'S1'!L2","v":0}]
[null,"DEPARTMENT OF TRANSPORTATION",null,null,null,null,null,"PLANT CODE",null,{"$f":"'S1'!L3","v":0}]
[null,"PENNSYLVANIA TURNPIKE COMMISSION",null,null,null,null,null,"AGG SIZE",null,{"$f":"'S1'!L4","v":"Type 2"}]
[{"$f":"'S1'!$A$5","v":"Aggregate 2023"}]

{"sheet":"Chart 97-120","index":14,"n_rows":5,"n_cols":10,"rows_kept":5,"cut":false,"hidden":true,"merged":[[3,1,3,5],[3,7,3,8],[3,9,3,10],[4,0,4,1],[0,0,2,0],[1,1,1,5],[1,7,1,8],[1,9,1,10],[2,1,2,5],[2,7,2,8],[2,9,2,10]]}
[]
[null,"COMMONWEALTH OF PENNSYLVANIA",null,null,null,null,null,"DISTRICT",null,{"$f":"'S1'!L2","v":0}]
[null,"DEPARTMENT OF TRANSPORTATION",null,null,null,null,null,"PLANT CODE",null,{"$f":"'S1'!L3","v":0}]
[null,"PENNSYLVANIA TURNPIKE COMMISSION",null,null,null,null,null,"AGG SIZE",null,{"$f":"'S1'!L4","v":"Type 2"}]
[{"$f":"'S1'!$A$5","v":"Aggregate 2023"}]

{"sheet":"ST1","index":15,"n_rows":149,"n_cols":6,"rows_kept":149,"cut":false,"hidden":true,"merged":[]}
[]
[]
[]
["Samp #",100,8,4,0.375,0.5]
[]
[1,{"$f":"'S1'!$D$17","v":"  "},{"$f":"'S1'!$D$16","v":"  "},{"$f":"'S1'!$D$15","v":"  "},{"$f":"'S1'!$D$14","v":"  "},{"$f":"'S1'!$D$13","v":"  "}]
[2,{"$f":"'S1'!$F$17","v":"  "},{"$f":"'S1'!$F$16","v":"  "},{"$f":"'S1'!$F$15","v":"  "},{"$f":"'S1'!$F$14","v":"  "},{"$f":"'S1'!$F$13","v":"  "}]
[3,{"$f":"'S1'!$H$17","v":"  "},{"$f":"'S1'!$H$16","v":"  "},{"$f":"'S1'!$H$15","v":"  "},{"$f":"'S1'!$H$14","v":"  "},{"$f":"'S1'!$H$13","v":"  "}]
[4,{"$f":"'S1'!$J$17","v":"  "},{"$f":"'S1'!$J$16","v":"  "},{"$f":"'S1'!$J$15","v":"  "},{"$f":"'S1'!$J$14","v":"  "},{"$f":"'S1'!$J$13","v":"  "}]
[5,{"$f":"'S1'!$L$17","v":"  "},{"$f":"'S1'!$L$16","v":"  "},{"$f":"'S1'!$L$15","v":"  "},{"$f":"'S1'!$L$14","v":"  "},{"$f":"'S1'!$L$13","v":"  "}]
[6,{"$f":"'S1'!$N$17","v":"  "},{"$f":"'S1'!$N$16","v":"  "},{"$f":"'S1'!$N$15","v":"  "},{"$f":"'S1'!$N$14","v":"  "},{"$f":"'S1'!$N$13","v":"  "}]
[7,{"$f":"'S1'!$D$33","v":"  "},{"$f":"'S1'!$D$32","v":"  "},{"$f":"'S1'!$D$31","v":"  "},{"$f":"'S1'!$D$30","v":"  "},{"$f":"'S1'!$D$29","v":"  "}]
[8,{"$f":"'S1'!$F$33","v":"  "},{"$f":"'S1'!$F$32","v":"  "},{"$f":"'S1'!$F$31","v":"  "},{"$f":"'S1'!$F$30","v":"  "},{"$f":"'S1'!$F$29","v":"  "}]
[9,{"$f":"'S1'!$H$33","v":"  "},{"$f":"'S1'!$H$32","v":"  "},{"$f":"'S1'!$H$31","v":"  "},{"$f":"'S1'!$H$30","v":"  "},{"$f":"'S1'!$H$29","v":"  "}]
[10,{"$f":"'S1'!$J$33","v":"  "},{"$f":"'S1'!$J$32","v":"  "},{"$f":"'S1'!$J$31","v":"  "},{"$f":"'S1'!$J$30","v":"  "},{"$f":"'S1'!$J$29","v":"  "}]
[11,{"$f":"'S1'!$L$33","v":"  "},{"$f":"'S1'!$L$32","v":"  "},{"$f":"'S1'!$L$31","v":"  "},{"$f":"'S1'!$L$30","v":"  "},{"$f":"'S1'!$L$29","v":"  "}]
[12,{"$f":"'S1'!$N$33","v":"  "},{"$f":"'S1'!$N$32","v":"  "},{"$f":"'S1'!$N$31","v":"  "},{"$f":"'S1'!$N$30","v":"  "},{"$f":"'S1'!$N$29","v":"  "}]
[13,{"$f":"'S2'!$D$17","v":"  "},{"$f":"'S2'!$D$16","v":"  "},{"$f":"'S2'!$D$15","v":"  "},{"$f":"'S2'!$D$14","v":"  "},{"$f":"'S2'!$D$13","v":"  "}]
[14,{"$f":"'S2'!$F$17","v":"  "},{"$f":"'S2'!$F$16","v":"  "},{"$f":"'S2'!$F$15","v":"  "},{"$f":"'S2'!$F$14","v":"  "},{"$f":"'S2'!$F$13","v":"  "}]
[15,{"$f":"'S2'!$H$17","v":"  "},{"$f":"'S2'!$H$16","v":"  "},{"$f":"'S2'!$H$15","v":"  "},{"$f":"'S2'!$H$14","v":"  "},{"$f":"'S2'!$H$13","v":"  "}]
[16,{"$f":"'S2'!$J$17","v":"  "},{"$f":"'S2'!$J$16","v":"  "},{"$f":"'S2'!$J$15","v":"  "},{"$f":"'S2'!$J$14","v":"  "},{"$f":"'S2'!$J$13","v":"  "}]
[17,{"$f":"'S2'!$L$17","v":"  "},{"$f":"'S2'!$L$16","v":"  "},{"$f":"'S2'!$L$15","v":"  "},{"$f":"'S2'!$L$14","v":"  "},{"$f":"'S2'!$L$13","v":"  "}]
[18,{"$f":"'S2'!$N$17","v":"  "},{"$f":"'S2'!$N$16","v":"  "},{"$f":"'S2'!$N$15","v":"  "},{"$f":"'S2'!$N$14","v":"  "},{"$f":"'S2'!$N$13","v":"  "}]
[19,{"$f":"'S2'!$D$33","v":"  "},{"$f":"'S2'!$D$32","v":"  "},{"$f":"'S2'!$D$31","v":"  "},{"$f":"'S2'!$D$30","v":"  "},{"$f":"'S2'!$D$29","v":"  "}]
[20,{"$f":"'S2'!$F$33","v":"  "},{"$f":"'S2'!$F$32","v":"  "},{"$f":"'S2'!$F$31","v":"  "},{"$f":"'S2'!$F$30","v":"  "},{"$f":"'S2'!$F$29","v":"  "}]
[21,{"$f":"'S2'!$H$33","v":"  "},{"$f":"'S2'!$H$32","v":"  "},{"$f":"'S2'!$H$31","v":"  "},{"$f":"'S2'!$H$30","v":"  "},{"$f":"'S2'!$H$29","v":"  "}]
[22,{"$f":"'S2'!$J$33","v":"  "},{"$f":"'S2'!$J$32","v":"  "},{"$f":"'S2'!$J$31","v":"  "},{"$f":"'S2'!$J$30","v":"  "},{"$f":"'S2'!$J$29","v":"  "}]
[23,{"$f":"'S2'!$L$33","v":"  "},{"$f":"'S2'!$L$32","v":"  "},{"$f":"'S2'!$L$31","v":"  "},{"$f":"'S2'!$L$30","v":"  "},{"$f":"'S2'!$L$29","v":"  "}]
[24,{"$f":"'S2'!$N$33","v":"  "},{"$f":"'S2'!$N$32","v":"  "},{"$f":"'S2'!$N$31","v":"  "},{"$f":"'S2'!$N$30","v":"  "},{"$f":"'S2'!$N$29","v":"  "}]
[25,{"$f":"'S3'!$D$17","v":"  "},{"$f":"'S3'!$D$16","v":"  "},{"$f":"'S3'!$D$15","v":"  "},{"$f":"'S3'!$D$14","v":"  "},{"$f":"'S3'!$D$13","v":"  "}]
[26,{"$f":"'S3'!$F$17","v":"  "},{"$f":"'S3'!$F$16","v":"  "},{"$f":"'S3'!$F$15","v":"  "},{"$f":"'S3'!$F$14","v":"  "},{"$f":"'S3'!$F$13","v":"  "}]
[27,{"$f":"'S3'!$H$17","v":"  "},{"$f":"'S3'!$H$16","v":"  "},{"$f":"'S3'!$H$15","v":"  "},{"$f":"'S3'!$H$14","v":"  "},{"$f":"'S3'!$H$13","v":"  "}]
[28,{"$f":"'S3'!$J$17","v":"  "},{"$f":"'S3'!$J$16","v":"  "},{"$f":"'S3'!$J$15","v":"  "},{"$f":"'S3'!$J$14","v":"  "},{"$f":"'S3'!$J$13","v":"  "}]
[29,{"$f":"'S3'!$L$17","v":"  "},{"$f":"'S3'!$L$16","v":"  "},{"$f":"'S3'!$L$15","v":"  "},{"$f":"'S3'!$L$14","v":"  "},{"$f":"'S3'!$L$13","v":"  "}]
[30,{"$f":"'S3'!$N$17","v":"  "},{"$f":"'S3'!$N$16","v":"  "},{"$f":"'S3'!$N$15","v":"  "},{"$f":"'S3'!$N$14","v":"  "},{"$f":"'S3'!$N$13","v":"  "}]
[31,{"$f":"'S3'!$D$33","v":"  "},{"$f":"'S3'!$D$32","v":"  "},{"$f":"'S3'!$D$31","v":"  "},{"$f":"'S3'!$D$30","v":"  "},{"$f":"'S3'!$D$29","v":"  "}]
[32,{"$f":"'S3'!$F$33","v":"  "},{"$f":"'S3'!$F$32","v":"  "},{"$f":"'S3'!$F$31","v":"  "},{"$f":"'S3'!$F$30","v":"  "},{"$f":"'S3'!$F$29","v":"  "}]
[33,{"$f":"'S3'!$H$33","v":"  "},{"$f":"'S3'!$H$32","v":"  "},{"$f":"'S3'!$H$31","v":"  "},{"$f":"'S3'!$H$30","v":"  "},{"$f":"'S3'!$H$29","v":"  "}]
[34,{"$f":"'S3'!$J$33","v":"  "},{"$f":"'S3'!$J$32","v":"  "},{"$f":"'S3'!$J$31","v":"  "},{"$f":"'S3'!$J$30","v":"  "},{"$f":"'S3'!$J$29","v":"  "}]
[35,{"$f":"'S3'!$L$33","v":"  "},{"$f":"'S3'!$L$32","v":"  "},{"$f":"'S3'!$L$31","v":"  "},{"$f":"'S3'!$L$30","v":"  "},{"$f":"'S3'!$L$29","v":"  "}]
[36,{"$f":"'S3'!$N$33","v":"  "},{"$f":"'S3'!$N$32","v":"  "},{"$f":"'S3'!$N$31","v":"  "},{"$f":"'S3'!$N$30","v":"  "},{"$f":"'S3'!$N$29","v":"  "}]
[37,{"$f":"'S4'!$D$17","v":"  "},{"$f":"'S4'!$D$16","v":"  "},{"$f":"'S4'!$D$15","v":"  "},{"$f":"'S4'!$D$14","v":"  "},{"$f":"'S4'!$D$13","v":"  "}]
[38,{"$f":"'S4'!$F$17","v":"  "},{"$f":"'S4'!$F$16","v":"  "},{"$f":"'S4'!$F$15","v":"  "},{"$f":"'S4'!$F$14","v":"  "},{"$f":"'S4'!$F$13","v":"  "}]
[39,{"$f":"'S4'!$H$17","v":"  "},{"$f":"'S4'!$H$16","v":"  "},{"$f":"'S4'!$H$15","v":"  "},{"$f":"'S4'!$H$14","v":"  "},{"$f":"'S4'!$H$13","v":"  "}]
[40,{"$f":"'S4'!$J$17","v":"  "},{"$f":"'S4'!$J$16","v":"  "},{"$f":"'S4'!$J$15","v":"  "},{"$f":"'S4'!$J$14","v":"  "},{"$f":"'S4'!$J$13","v":"  "}]
[41,{"$f":"'S4'!$L$17","v":"  "},{"$f":"'S4'!$L$16","v":"  "},{"$f":"'S4'!$L$15","v":"  "},{"$f":"'S4'!$L$14","v":"  "},{"$f":"'S4'!$L$13","v":"  "}]
[42,{"$f":"'S4'!$N$17","v":"  "},{"$f":"'S4'!$N$16","v":"  "},{"$f":"'S4'!$N$15","v":"  "},{"$f":"'S4'!$N$14","v":"  "},{"$f":"'S4'!$N$13","v":"  "}]
[43,{"$f":"'S4'!$D$33","v":"  "},{"$f":"'S4'!$D$32","v":"  "},{"$f":"'S4'!$D$31","v":"  "},{"$f":"'S4'!$D$30","v":"  "},{"$f":"'S4'!$D$29","v":"  "}]
[44,{"$f":"'S4'!$F$33","v":"  "},{"$f":"'S4'!$F$32","v":"  "},{"$f":"'S4'!$F$31","v":"  "},{"$f":"'S4'!$F$30","v":"  "},{"$f":"'S4'!$F$29","v":"  "}]
[45,{"$f":"'S4'!$H$33","v":"  "},{"$f":"'S4'!$H$32","v":"  "},{"$f":"'S4'!$H$31","v":"  "},{"$f":"'S4'!$H$30","v":"  "},{"$f":"'S4'!$H$29","v":"  "}]
[46,{"$f":"'S4'!$J$33","v":"  "},{"$f":"'S4'!$J$32","v":"  "},{"$f":"'S4'!$J$31","v":"  "},{"$f":"'S4'!$J$30","v":"  "},{"$f":"'S4'!$J$29","v":"  "}]
[47,{"$f":"'S4'!$L$33","v":"  "},{"$f":"'S4'!$L$32","v":"  "},{"$f":"'S4'!$L$31","v":"  "},{"$f":"'S4'!$L$30","v":"  "},{"$f":"'S4'!$L$29","v":"  "}]
[48,{"$f":"'S4'!$N$33","v":"  "},{"$f":"'S4'!$N$32","v":"  "},{"$f":"'S4'!$N$31","v":"  "},{"$f":"'S4'!$N$30","v":"  "},{"$f":"'S4'!$N$29","v":"  "}]
[49,{"$f":"'S5'!$D$17","v":"  "},{"$f":"'S5'!$D$16","v":"  "},{"$f":"'S5'!$D$15","v":"  "},{"$f":"'S5'!$D$14","v":"  "},{"$f":"'S5'!$D$13","v":"  "}]
[50,{"$f":"'S5'!$F$17","v":"  "},{"$f":"'S5'!$F$16","v":"  "},{"$f":"'S5'!$F$15","v":"  "},{"$f":"'S5'!$F$14","v":"  "},{"$f":"'S5'!$F$13","v":"  "}]
[51,{"$f":"'S5'!$H$17","v":"  "},{"$f":"'S5'!$H$16","v":"  "},{"$f":"'S5'!$H$15","v":"  "},{"$f":"'S5'!$H$14","v":"  "},{"$f":"'S5'!$H$13","v":"  "}]
[52,{"$f":"'S5'!$J$17","v":"  "},{"$f":"'S5'!$J$16","v":"  "},{"$f":"'S5'!$J$15","v":"  "},{"$f":"'S5'!$J$14","v":"  "},{"$f":"'S5'!$J$13","v":"  "}]
[53,{"$f":"'S5'!$L$17","v":"  "},{"$f":"'S5'!$L$16","v":"  "},{"$f":"'S5'!$L$15","v":"  "},{"$f":"'S5'!$L$14","v":"  "},{"$f":"'S5'!$L$13","v":"  "}]
[54,{"$f":"'S5'!$N$17","v":"  "},{"$f":"'S5'!$N$16","v":"  "},{"$f":"'S5'!$N$15","v":"  "},{"$f":"'S5'!$N$14","v":"  "},{"$f":"'S5'!$N$13","v":"  "}]
[55,{"$f":"'S5'!$D$33","v":"  "},{"$f":"'S5'!$D$32","v":"  "},{"$f":"'S5'!$D$31","v":"  "},{"$f":"'S5'!$D$30","v":"  "},{"$f":"'S5'!$D$29","v":"  "}]
[56,{"$f":"'S5'!$F$33","v":"  "},{"$f":"'S5'!$F$32","v":"  "},{"$f":"'S5'!$F$31","v":"  "},{"$f":"'S5'!$F$30","v":"  "},{"$f":"'S5'!$F$29","v":"  "}]
[57,{"$f":"'S5'!$H$33","v":"  "},{"$f":"'S5'!$H$32","v":"  "},{"$f":"'S5'!$H$31","v":"  "},{"$f":"'S5'!$H$30","v":"  "},{"$f":"'S5'!$H$29","v":"  "}]
[58,{"$f":"'S5'!$J$33","v":"  "},{"$f":"'S5'!$J$32","v":"  "},{"$f":"'S5'!$J$31","v":"  "},{"$f":"'S5'!$J$30","v":"  "},{"$f":"'S5'!$J$29","v":"  "}]
[59,{"$f":"'S5'!$L$33","v":"  "},{"$f":"'S5'!$L$32","v":"  "},{"$f":"'S5'!$L$31","v":"  "},{"$f":"'S5'!$L$30","v":"  "},{"$f":"'S5'!$L$29","v":"  "}]
[60,{"$f":"'S5'!$N$33","v":"  "},{"$f":"'S5'!$N$32","v":"  "},{"$f":"'S5'!$N$31","v":"  "},{"$f":"'S5'!$N$30","v":"  "},{"$f":"'S5'!$N$29","v":"  "}]
[61,{"$f":"'S6'!$D$17","v":"  "},{"$f":"'S6'!$D$16","v":"  "},{"$f":"'S6'!$D$15","v":"  "},{"$f":"'S6'!$D$14","v":"  "},{"$f":"'S6'!$D$13","v":"  "}]
[62,{"$f":"'S6'!$F$17","v":"  "},{"$f":"'S6'!$F$16","v":"  "},{"$f":"'S6'!$F$15","v":"  "},{"$f":"'S6'!$F$14","v":"  "},{"$f":"'S6'!$F$13","v":"  "}]
[63,{"$f":"'S6'!$H$17","v":"  "},{"$f":"'S6'!$H$16","v":"  "},{"$f":"'S6'!$H$15","v":"  "},{"$f":"'S6'!$H$14","v":"  "},{"$f":"'S6'!$H$13","v":"  "}]
[64,{"$f":"'S6'!$J$17","v":"  "},{"$f":"'S6'!$J$16","v":"  "},{"$f":"'S6'!$J$15","v":"  "},{"$f":"'S6'!$J$14","v":"  "},{"$f":"'S6'!$J$13","v":"  "}]
[65,{"$f":"'S6'!$L$17","v":"  "},{"$f":"'S6'!$L$16","v":"  "},{"$f":"'S6'!$L$15","v":"  "},{"$f":"'S6'!$L$14","v":"  "},{"$f":"'S6'!$L$13","v":"  "}]
[66,{"$f":"'S6'!$N$17","v":"  "},{"$f":"'S6'!$N$16","v":"  "},{"$f":"'S6'!$N$15","v":"  "},{"$f":"'S6'!$N$14","v":"  "},{"$f":"'S6'!$N$13","v":"  "}]
[67,{"$f":"'S6'!$D$33","v":"  "},{"$f":"'S6'!$D$32","v":"  "},{"$f":"'S6'!$D$31","v":"  "},{"$f":"'S6'!$D$30","v":"  "},{"$f":"'S6'!$D$29","v":"  "}]
[68,{"$f":"'S6'!$F$33","v":"  "},{"$f":"'S6'!$F$32","v":"  "},{"$f":"'S6'!$F$31","v":"  "},{"$f":"'S6'!$F$30","v":"  "},{"$f":"'S6'!$F$29","v":"  "}]
[69,{"$f":"'S6'!$H$33","v":"  "},{"$f":"'S6'!$H$32","v":"  "},{"$f":"'S6'!$H$31","v":"  "},{"$f":"'S6'!$H$30","v":"  "},{"$f":"'S6'!$H$29","v":"  "}]
[70,{"$f":"'S6'!$J$33","v":"  "},{"$f":"'S6'!$J$32","v":"  "},{"$f":"'S6'!$J$31","v":"  "},{"$f":"'S6'!$J$30","v":"  "},{"$f":"'S6'!$J$29","v":"  "}]
[71,{"$f":"'S6'!$L$33","v":"  "},{"$f":"'S6'!$L$32","v":"  "},{"$f":"'S6'!$L$31","v":"  "},{"$f":"'S6'!$L$30","v":"  "},{"$f":"'S6'!$L$29","v":"  "}]
[72,{"$f":"'S6'!$N$33","v":"  "},{"$f":"'S6'!$N$32","v":"  "},{"$f":"'S6'!$N$31","v":"  "},{"$f":"'S6'!$N$30","v":"  "},{"$f":"'S6'!$N$29","v":"  "}]
[73,{"$f":"'S7'!$D$17","v":"  "},{"$f":"'S7'!$D$16","v":"  "},{"$f":"'S7'!$D$15","v":"  "},{"$f":"'S7'!$D$14","v":"  "},{"$f":"'S7'!$D$13","v":"  "}]
[74,{"$f":"'S7'!$F$17","v":"  "},{"$f":"'S7'!$F$16","v":"  "},{"$f":"'S7'!$F$15","v":"  "},{"$f":"'S7'!$F$14","v":"  "},{"$f":"'S7'!$F$13","v":"  "}]
[75,{"$f":"'S7'!$H$17","v":"  "},{"$f":"'S7'!$H$16","v":"  "},{"$f":"'S7'!$H$15","v":"  "},{"$f":"'S7'!$H$14","v":"  "},{"$f":"'S7'!$H$13","v":"  "}]
[76,{"$f":"'S7'!$J$17","v":"  "},{"$f":"'S7'!$J$16","v":"  "},{"$f":"'S7'!$J$15","v":"  "},{"$f":"'S7'!$J$14","v":"  "},{"$f":"'S7'!$J$13","v":"  "}]
[77,{"$f":"'S7'!$L$17","v":"  "},{"$f":"'S7'!$L$16","v":"  "},{"$f":"'S7'!$L$15","v":"  "},{"$f":"'S7'!$L$14","v":"  "},{"$f":"'S7'!$L$13","v":"  "}]
[78,{"$f":"'S7'!$N$17","v":"  "},{"$f":"'S7'!$N$16","v":"  "},{"$f":"'S7'!$N$15","v":"  "},{"$f":"'S7'!$N$14","v":"  "},{"$f":"'S7'!$N$13","v":"  "}]
[79,{"$f":"'S7'!$D$33","v":"  "},{"$f":"'S7'!$D$32","v":"  "},{"$f":"'S7'!$D$31","v":"  "},{"$f":"'S7'!$D$30","v":"  "},{"$f":"'S7'!$D$29","v":"  "}]
[80,{"$f":"'S7'!$F$33","v":"  "},{"$f":"'S7'!$F$32","v":"  "},{"$f":"'S7'!$F$31","v":"  "},{"$f":"'S7'!$F$30","v":"  "},{"$f":"'S7'!$F$29","v":"  "}]
[81,{"$f":"'S7'!$H$33","v":"  "},{"$f":"'S7'!$H$32","v":"  "},{"$f":"'S7'!$H$31","v":"  "},{"$f":"'S7'!$H$30","v":"  "},{"$f":"'S7'!$H$29","v":"  "}]
[82,{"$f":"'S7'!$J$33","v":"  "},{"$f":"'S7'!$J$32","v":"  "},{"$f":"'S7'!$J$31","v":"  "},{"$f":"'S7'!$J$30","v":"  "},{"$f":"'S7'!$J$29","v":"  "}]
[83,{"$f":"'S7'!$L$33","v":"  "},{"$f":"'S7'!$L$32","v":"  "},{"$f":"'S7'!$L$31","v":"  "},{"$f":"'S7'!$L$30","v":"  "},{"$f":"'S7'!$L$29","v":"  "}]
[84,{"$f":"'S7'!$N$33","v":"  "},{"$f":"'S7'!$N$32","v":"  "},{"$f":"'S7'!$N$31","v":"  "},{"$f":"'S7'!$N$30","v":"  "},{"$f":"'S7'!$N$29","v":"  "}]
[85,{"$f":"'S8'!$D$17","v":"  "},{"$f":"'S8'!$D$16","v":"  "},{"$f":"'S8'!$D$15","v":"  "},{"$f":"'S8'!$D$14","v":"  "},{"$f":"'S8'!$D$13","v":"  "}]
[86,{"$f":"'S8'!$F$17","v":"  "},{"$f":"'S8'!$F$16","v":"  "},{"$f":"'S8'!$F$15","v":"  "},{"$f":"'S8'!$F$14","v":"  "},{"$f":"'S8'!$F$13","v":"  "}]
[87,{"$f":"'S8'!$H$17","v":"  "},{"$f":"'S8'!$H$16","v":"  "},{"$f":"'S8'!$H$15","v":"  "},{"$f":"'S8'!$H$14","v":"  "},{"$f":"'S8'!$H$13","v":"  "}]
[88,{"$f":"'S8'!$J$17","v":"  "},{"$f":"'S8'!$J$16","v":"  "},{"$f":"'S8'!$J$15","v":"  "},{"$f":"'S8'!$J$14","v":"  "},{"$f":"'S8'!$J$13","v":"  "}]
[89,{"$f":"'S8'!$L$17","v":"  "},{"$f":"'S8'!$L$16","v":"  "},{"$f":"'S8'!$L$15","v":"  "},{"$f":"'S8'!$L$14","v":"  "},{"$f":"'S8'!$L$13","v":"  "}]
[90,{"$f":"'S8'!$N$17","v":"  "},{"$f":"'S8'!$N$16","v":"  "},{"$f":"'S8'!$N$15","v":"  "},{"$f":"'S8'!$N$14","v":"  "},{"$f":"'S8'!$N$13","v":"  "}]
[91,{"$f":"'S8'!$D$33","v":"  "},{"$f":"'S8'!$D$32","v":"  "},{"$f":"'S8'!$D$31","v":"  "},{"$f":"'S8'!$D$30","v":"  "},{"$f":"'S8'!$D$29","v":"  "}]
[92,{"$f":"'S8'!$F$33","v":"  "},{"$f":"'S8'!$F$32","v":"  "},{"$f":"'S8'!$F$31","v":"  "},{"$f":"'S8'!$F$30","v":"  "},{"$f":"'S8'!$F$29","v":"  "}]
[93,{"$f":"'S8'!$H$33","v":"  "},{"$f":"'S8'!$H$32","v":"  "},{"$f":"'S8'!$H$31","v":"  "},{"$f":"'S8'!$H$30","v":"  "},{"$f":"'S8'!$H$29","v":"  "}]
[94,{"$f":"'S8'!$J$33","v":"  "},{"$f":"'S8'!$J$32","v":"  "},{"$f":"'S8'!$J$31","v":"  "},{"$f":"'S8'!$J$30","v":"  "},{"$f":"'S8'!$J$29","v":"  "}]
[95,{"$f":"'S8'!$L$33","v":"  "},{"$f":"'S8'!$L$32","v":"  "},{"$f":"'S8'!$L$31","v":"  "},{"$f":"'S8'!$L$30","v":"  "},{"$f":"'S8'!$L$29","v":"  "}]
[96,{"$f":"'S8'!$N$33","v":"  "},{"$f":"'S8'!$N$32","v":"  "},{"$f":"'S8'!$N$31","v":"  "},{"$f":"'S8'!$N$30","v":"  "},{"$f":"'S8'!$N$29","v":"  "}]
[97,{"$f":"'S9'!$D$17","v":"  "},{"$f":"'S9'!$D$16","v":"  "},{"$f":"'S9'!$D$15","v":"  "},{"$f":"'S9'!$D$14","v":"  "},{"$f":"'S9'!$D$13","v":"  "}]
[98,{"$f":"'S9'!$F$17","v":"  "},{"$f":"'S9'!$F$16","v":"  "},{"$f":"'S9'!$F$15","v":"  "},{"$f":"'S9'!$F$14","v":"  "},{"$f":"'S9'!$F$13","v":"  "}]
[99,{"$f":"'S9'!$H$17","v":"  "},{"$f":"'S9'!$H$16","v":"  "},{"$f":"'S9'!$H$15","v":"  "},{"$f":"'S9'!$H$14","v":"  "},{"$f":"'S9'!$H$13","v":"  "}]
[100,{"$f":"'S9'!$J$17","v":"  "},{"$f":"'S9'!$J$16","v":"  "},{"$f":"'S9'!$J$15","v":"  "},{"$f":"'S9'!$J$14","v":"  "},{"$f":"'S9'!$J$13","v":"  "}]
[101,{"$f":"'S9'!$L$17","v":"  "},{"$f":"'S9'!$L$16","v":"  "},{"$f":"'S9'!$L$15","v":"  "},{"$f":"'S9'!$L$14","v":"  "},{"$f":"'S9'!$L$13","v":"  "}]
[102,{"$f":"'S9'!$N$17","v":"  "},{"$f":"'S9'!$N$16","v":"  "},{"$f":"'S9'!$N$15","v":"  "},{"$f":"'S9'!$N$14","v":"  "},{"$f":"'S9'!$N$13","v":"  "}]
[103,{"$f":"'S9'!$D$33","v":"  "},{"$f":"'S9'!$D$32","v":"  "},{"$f":"'S9'!$D$31","v":"  "},{"$f":"'S9'!$D$30","v":"  "},{"$f":"'S9'!$D$29","v":"  "}]
[104,{"$f":"'S9'!$F$33","v":"  "},{"$f":"'S9'!$F$32","v":"  "},{"$f":"'S9'!$F$31","v":"  "},{"$f":"'S9'!$F$30","v":"  "},{"$f":"'S9'!$F$29","v":"  "}]
[105,{"$f":"'S9'!$H$33","v":"  "},{"$f":"'S9'!$H$32","v":"  "},{"$f":"'S9'!$H$31","v":"  "},{"$f":"'S9'!$H$30","v":"  "},{"$f":"'S9'!$H$29","v":"  "}]
[106,{"$f":"'S9'!$J$33","v":"  "},{"$f":"'S9'!$J$32","v":"  "},{"$f":"'S9'!$J$31","v":"  "},{"$f":"'S9'!$J$30","v":"  "},{"$f":"'S9'!$J$29","v":"  "}]
[107,{"$f":"'S9'!$L$33","v":"  "},{"$f":"'S9'!$L$32","v":"  "},{"$f":"'S9'!$L$31","v":"  "},{"$f":"'S9'!$L$30","v":"  "},{"$f":"'S9'!$L$29","v":"  "}]
[108,{"$f":"'S9'!$N$33","v":"  "},{"$f":"'S9'!$N$32","v":"  "},{"$f":"'S9'!$N$31","v":"  "},{"$f":"'S9'!$N$30","v":"  "},{"$f":"'S9'!$N$29","v":"  "}]
[109,{"$f":"'S10'!$D$17","v":"  "},{"$f":"'S10'!$D$16","v":"  "},{"$f":"'S10'!$D$15","v":"  "},{"$f":"'S10'!$D$14","v":"  "},{"$f":"'S10'!$D$13","v":"  "}]
[110,{"$f":"'S10'!$F$17","v":"  "},{"$f":"'S10'!$F$16","v":"  "},{"$f":"'S10'!$F$15","v":"  "},{"$f":"'S10'!$F$14","v":"  "},{"$f":"'S10'!$F$13","v":"  "}]
[111,{"$f":"'S10'!$H$17","v":"  "},{"$f":"'S10'!$H$16","v":"  "},{"$f":"'S10'!$H$15","v":"  "},{"$f":"'S10'!$H$14","v":"  "},{"$f":"'S10'!$H$13","v":"  "}]
[112,{"$f":"'S10'!$J$17","v":"  "},{"$f":"'S10'!$J$16","v":"  "},{"$f":"'S10'!$J$15","v":"  "},{"$f":"'S10'!$J$14","v":"  "},{"$f":"'S10'!$J$13","v":"  "}]
[113,{"$f":"'S10'!$L$17","v":"  "},{"$f":"'S10'!$L$16","v":"  "},{"$f":"'S10'!$L$15","v":"  "},{"$f":"'S10'!$L$14","v":"  "},{"$f":"'S10'!$L$13","v":"  "}]
[114,{"$f":"'S10'!$N$17","v":"  "},{"$f":"'S10'!$N$16","v":"  "},{"$f":"'S10'!$N$15","v":"  "},{"$f":"'S10'!$N$14","v":"  "},{"$f":"'S10'!$N$13","v":"  "}]
[115,{"$f":"'S10'!$D$33","v":"  "},{"$f":"'S10'!$D$32","v":"  "},{"$f":"'S10'!$D$31","v":"  "},{"$f":"'S10'!$D$30","v":"  "},{"$f":"'S10'!$D$29","v":"  "}]
[116,{"$f":"'S10'!$F$33","v":"  "},{"$f":"'S10'!$F$32","v":"  "},{"$f":"'S10'!$F$31","v":"  "},{"$f":"'S10'!$F$30","v":"  "},{"$f":"'S10'!$F$29","v":"  "}]
[117,{"$f":"'S10'!$H$33","v":"  "},{"$f":"'S10'!$H$32","v":"  "},{"$f":"'S10'!$H$31","v":"  "},{"$f":"'S10'!$H$30","v":"  "},{"$f":"'S10'!$H$29","v":"  "}]
[118,{"$f":"'S10'!$J$33","v":"  "},{"$f":"'S10'!$J$32","v":"  "},{"$f":"'S10'!$J$31","v":"  "},{"$f":"'S10'!$J$30","v":"  "},{"$f":"'S10'!$J$29","v":"  "}]
[119,{"$f":"'S10'!$L$33","v":"  "},{"$f":"'S10'!$L$32","v":"  "},{"$f":"'S10'!$L$31","v":"  "},{"$f":"'S10'!$L$30","v":"  "},{"$f":"'S10'!$L$29","v":"  "}]
[120,{"$f":"'S10'!$N$33","v":"  "},{"$f":"'S10'!$N$32","v":"  "},{"$f":"'S10'!$N$31","v":"  "},{"$f":"'S10'!$N$30","v":"  "},{"$f":"'S10'!$N$29","v":"  "}]
[121,{"$f":"#REF!","v":{"$error":"#REF!"}},{"$f":"#REF!","v":{"$error":"#REF!"}},{"$f":"#REF!","v":{"$error":"#REF!"}},{"$f":"#REF!","v":{"$error":"#REF!"}},{"$f":"#REF!","v":{"$error":"#REF!"}}]
[122,{"$f":"#REF!","v":{"$error":"#REF!"}},{"$f":"#REF!","v":{"$error":"#REF!"}},{"$f":"#REF!","v":{"$error":"#REF!"}},{"$f":"#REF!","v":{"$error":"#REF!"}},{"$f":"#REF!","v":{"$error":"#REF!"}}]
[123,{"$f":"#REF!","v":{"$error":"#REF!"}},{"$f":"#REF!","v":{"$error":"#REF!"}},{"$f":"#REF!","v":{"$error":"#REF!"}},{"$f":"#REF!","v":{"$error":"#REF!"}},{"$f":"#REF!","v":{"$error":"#REF!"}}]
[124,{"$f":"#REF!","v":{"$error":"#REF!"}},{"$f":"#REF!","v":{"$error":"#REF!"}},{"$f":"#REF!","v":{"$error":"#REF!"}},{"$f":"#REF!","v":{"$error":"#REF!"}},{"$f":"#REF!","v":{"$error":"#REF!"}}]
[125,{"$f":"#REF!","v":{"$error":"#REF!"}},{"$f":"#REF!","v":{"$error":"#REF!"}},{"$f":"#REF!","v":{"$error":"#REF!"}},{"$f":"#REF!","v":{"$error":"#REF!"}},{"$f":"#REF!","v":{"$error":"#REF!"}}]
[126,{"$f":"#REF!","v":{"$error":"#REF!"}},{"$f":"#REF!","v":{"$error":"#REF!"}},{"$f":"#REF!","v":{"$error":"#REF!"}},{"$f":"#REF!","v":{"$error":"#REF!"}},{"$f":"#REF!","v":{"$error":"#REF!"}}]
[127,{"$f":"#REF!","v":{"$error":"#REF!"}},{"$f":"#REF!","v":{"$error":"#REF!"}},{"$f":"#REF!","v":{"$error":"#REF!"}},{"$f":"#REF!","v":{"$error":"#REF!"}},{"$f":"#REF!","v":{"$error":"#REF!"}}]
[128,{"$f":"#REF!","v":{"$error":"#REF!"}},{"$f":"#REF!","v":{"$error":"#REF!"}},{"$f":"#REF!","v":{"$error":"#REF!"}},{"$f":"#REF!","v":{"$error":"#REF!"}},{"$f":"#REF!","v":{"$error":"#REF!"}}]
[129,{"$f":"#REF!","v":{"$error":"#REF!"}},{"$f":"#REF!","v":{"$error":"#REF!"}},{"$f":"#REF!","v":{"$error":"#REF!"}},{"$f":"#REF!","v":{"$error":"#REF!"}},{"$f":"#REF!","v":{"$error":"#REF!"}}]
[130,{"$f":"#REF!","v":{"$error":"#REF!"}},{"$f":"#REF!","v":{"$error":"#REF!"}},{"$f":"#REF!","v":{"$error":"#REF!"}},{"$f":"#REF!","v":{"$error":"#REF!"}},{"$f":"#REF!","v":{"$error":"#REF!"}}]
[131,{"$f":"#REF!","v":{"$error":"#REF!"}},{"$f":"#REF!","v":{"$error":"#REF!"}},{"$f":"#REF!","v":{"$error":"#REF!"}},{"$f":"#REF!","v":{"$error":"#REF!"}},{"$f":"#REF!","v":{"$error":"#REF!"}}]
[132,{"$f":"#REF!","v":{"$error":"#REF!"}},{"$f":"#REF!","v":{"$error":"#REF!"}},{"$f":"#REF!","v":{"$error":"#REF!"}},{"$f":"#REF!","v":{"$error":"#REF!"}},{"$f":"#REF!","v":{"$error":"#REF!"}}]
[133,{"$f":"#REF!","v":{"$error":"#REF!"}},{"$f":"#REF!","v":{"$error":"#REF!"}},{"$f":"#REF!","v":{"$error":"#REF!"}},{"$f":"#REF!","v":{"$error":"#REF!"}},{"$f":"#REF!","v":{"$error":"#REF!"}}]
[134,{"$f":"#REF!","v":{"$error":"#REF!"}},{"$f":"#REF!","v":{"$error":"#REF!"}},{"$f":"#REF!","v":{"$error":"#REF!"}},{"$f":"#REF!","v":{"$error":"#REF!"}},{"$f":"#REF!","v":{"$error":"#REF!"}}]
[135,{"$f":"#REF!","v":{"$error":"#REF!"}},{"$f":"#REF!","v":{"$error":"#REF!"}},{"$f":"#REF!","v":{"$error":"#REF!"}},{"$f":"#REF!","v":{"$error":"#REF!"}},{"$f":"#REF!","v":{"$error":"#REF!"}}]
[136,{"$f":"#REF!","v":{"$error":"#REF!"}},{"$f":"#REF!","v":{"$error":"#REF!"}},{"$f":"#REF!","v":{"$error":"#REF!"}},{"$f":"#REF!","v":{"$error":"#REF!"}},{"$f":"#REF!","v":{"$error":"#REF!"}}]
[137,{"$f":"#REF!","v":{"$error":"#REF!"}},{"$f":"#REF!","v":{"$error":"#REF!"}},{"$f":"#REF!","v":{"$error":"#REF!"}},{"$f":"#REF!","v":{"$error":"#REF!"}},{"$f":"#REF!","v":{"$error":"#REF!"}}]
[138,{"$f":"#REF!","v":{"$error":"#REF!"}},{"$f":"#REF!","v":{"$error":"#REF!"}},{"$f":"#REF!","v":{"$error":"#REF!"}},{"$f":"#REF!","v":{"$error":"#REF!"}},{"$f":"#REF!","v":{"$error":"#REF!"}}]
[139,{"$f":"#REF!","v":{"$error":"#REF!"}},{"$f":"#REF!","v":{"$error":"#REF!"}},{"$f":"#REF!","v":{"$error":"#REF!"}},{"$f":"#REF!","v":{"$error":"#REF!"}},{"$f":"#REF!","v":{"$error":"#REF!"}}]
[140,{"$f":"#REF!","v":{"$error":"#REF!"}},{"$f":"#REF!","v":{"$error":"#REF!"}},{"$f":"#REF!","v":{"$error":"#REF!"}},{"$f":"#REF!","v":{"$error":"#REF!"}},{"$f":"#REF!","v":{"$error":"#REF!"}}]
[141,{"$f":"#REF!","v":{"$error":"#REF!"}},{"$f":"#REF!","v":{"$error":"#REF!"}},{"$f":"#REF!","v":{"$error":"#REF!"}},{"$f":"#REF!","v":{"$error":"#REF!"}},{"$f":"#REF!","v":{"$error":"#REF!"}}]
[142,{"$f":"#REF!","v":{"$error":"#REF!"}},{"$f":"#REF!","v":{"$error":"#REF!"}},{"$f":"#REF!","v":{"$error":"#REF!"}},{"$f":"#REF!","v":{"$error":"#REF!"}},{"$f":"#REF!","v":{"$error":"#REF!"}}]
[143,{"$f":"#REF!","v":{"$error":"#REF!"}},{"$f":"#REF!","v":{"$error":"#REF!"}},{"$f":"#REF!","v":{"$error":"#REF!"}},{"$f":"#REF!","v":{"$error":"#REF!"}},{"$f":"#REF!","v":{"$error":"#REF!"}}]
[144,{"$f":"#REF!","v":{"$error":"#REF!"}},{"$f":"#REF!","v":{"$error":"#REF!"}},{"$f":"#REF!","v":{"$error":"#REF!"}},{"$f":"#REF!","v":{"$error":"#REF!"}},{"$f":"#REF!","v":{"$error":"#REF!"}}]

{"sheet":"Avg","index":16,"n_rows":7,"n_cols":7,"rows_kept":7,"cut":false,"hidden":false,"merged":[[1,0,1,5],[1,6,1,7]]}
[]
["Average Gradation",null,null,null,null,null,{"$f":"IF(ISBLANK('S1'!L4),\" \",'S1'!L4)","v":"Type 2"}]
[]
["Sieve",100,8,4,0.375,0.5]
["Count",{"$f":"COUNT('ST1'!B6:B149)","v":0},{"$f":"COUNT('ST1'!C6:C149)","v":0},{"$f":"COUNT('ST1'!D6:D149)","v":0},{"$f":"COUNT('ST1'!E6:E149)","v":0},{"$f":"COUNT('ST1'!F6:F149)","v":0}]
["Avg",{"$f":"AVERAGE('ST1'!B6:B149)","v":{"$error":"#REF!"}},{"$f":"AVERAGE('ST1'!C6:C149)","v":{"$error":"#REF!"}},{"$f":"AVERAGE('ST1'!D6:D149)","v":{"$error":"#REF!"}},{"$f":"AVERAGE('ST1'!E6:E149)","v":{"$error":"#REF!"}},{"$f":"AVERAGE('ST1'!F6:F149)","v":{"$error":"#REF!"}}]
["St Dev",{"$f":"STDEV('ST1'!B6:B149)","v":{"$error":"#REF!"}},{"$f":"STDEV('ST1'!C6:C149)","v":{"$error":"#REF!"}},{"$f":"STDEV('ST1'!D6:D149)","v":{"$error":"#REF!"}},{"$f":"STDEV('ST1'!E6:E149)","v":{"$error":"#REF!"}},{"$f":"STDEV('ST1'!F6:F149)","v":{"$error":"#REF!"}}]

{"sheet":"S13","index":17,"n_rows":122,"n_cols":16,"rows_kept":122,"cut":false,"hidden":true,"merged":[[0,1,0,2],[0,3,0,4],[0,5,0,6],[0,7,0,8],[0,9,0,10]]}
["Sam. No.",0.5,null,0.375,null,"4 (Breaker, not plotted)",null,8,null,100,null,null,null,null,null,{"$f":"'S1'!L4","v":"Type 2"}]
[null,"N=1","N=3","N=1","N=3","N=1","N=3","N=1","N=3","N=1","N=3"]
[{"$f":"IF(ISBLANK('S1'!C$8),\" \",'S1'!C$8)","v":" "},{"$f":"IF(ISTEXT('S1'!$D$13),NA(),'S1'!$D$13)","v":{"$error":"#N/A"}},null,{"$f":"IF(ISTEXT('S1'!$D$14),NA(),'S1'!$D$14)","v":{"$error":"#N/A"}},null,{"$f":"IF(ISTEXT('S1'!$D$15),NA(),'S1'!$D$15)","v":{"$error":"#N/A"}},null,{"$f":"IF(ISTEXT('S1'!$D$16),NA(),'S1'!$D$16)","v":{"$error":"#N/A"}},null,{"$f":"IF(ISTEXT('S1'!$D$17),NA(),'S1'!$D$17)","v":{"$error":"#N/A"}}]
[{"$f":"IF(ISBLANK('S1'!E$8),\" \",'S1'!E$8)","v":" "},{"$f":"IF(ISTEXT('S1'!$F$13),NA(),'S1'!$F$13)","v":{"$error":"#N/A"}},null,{"$f":"IF(ISTEXT('S1'!$F$14),NA(),'S1'!$F$14)","v":{"$error":"#N/A"}},null,{"$f":"IF(ISTEXT('S1'!$F$15),NA(),'S1'!$F$15)","v":{"$error":"#N/A"}},null,{"$f":"IF(ISTEXT('S1'!$F$16),NA(),'S1'!$F$16)","v":{"$error":"#N/A"}},null,{"$f":"IF(ISTEXT('S1'!$F$17),NA(),'S1'!$F$17)","v":{"$error":"#N/A"}}]
[{"$f":"IF(ISBLANK('S1'!G$8),\" \",'S1'!G$8)","v":" "},{"$f":"IF(ISTEXT('S1'!$H$13),NA(),'S1'!$H$13)","v":{"$error":"#N/A"}},null,{"$f":"IF(ISTEXT('S1'!$H$14),NA(),'S1'!$H$14)","v":{"$error":"#N/A"}},null,{"$f":"IF(ISTEXT('S1'!$H$15),NA(),'S1'!$H$15)","v":{"$error":"#N/A"}},null,{"$f":"IF(ISTEXT('S1'!$H$16),NA(),'S1'!$H$16)","v":{"$error":"#N/A"}},null,{"$f":"IF(ISTEXT('S1'!$H$17),NA(),'S1'!$H$17)","v":{"$error":"#N/A"}}]
[{"$f":"IF(ISBLANK('S1'!I$8),\" \",'S1'!I$8)","v":" "},{"$f":"IF(ISTEXT('S1'!$J$13),NA(),'S1'!$J$13)","v":{"$error":"#N/A"}},null,{"$f":"IF(ISTEXT('S1'!$J$14),NA(),'S1'!$J$14)","v":{"$error":"#N/A"}},null,{"$f":"IF(ISTEXT('S1'!$J$15),NA(),'S1'!$J$15)","v":{"$error":"#N/A"}},null,{"$f":"IF(ISTEXT('S1'!$J$16),NA(),'S1'!$J$16)","v":{"$error":"#N/A"}},null,{"$f":"IF(ISTEXT('S1'!$J$17),NA(),'S1'!$J$17)","v":{"$error":"#N/A"}}]
[{"$f":"IF(ISBLANK('S1'!K$8),\" \",'S1'!K$8)","v":" "},{"$f":"IF(ISTEXT('S1'!$L$13),NA(),'S1'!$L$13)","v":{"$error":"#N/A"}},null,{"$f":"IF(ISTEXT('S1'!$L$14),NA(),'S1'!$L$14)","v":{"$error":"#N/A"}},null,{"$f":"IF(ISTEXT('S1'!$L$15),NA(),'S1'!$L$15)","v":{"$error":"#N/A"}},null,{"$f":"IF(ISTEXT('S1'!$L$16),NA(),'S1'!$L$16)","v":{"$error":"#N/A"}},null,{"$f":"IF(ISTEXT('S1'!$L$17),NA(),'S1'!$L$17)","v":{"$error":"#N/A"}}]
[{"$f":"IF(ISBLANK('S1'!M$8),\" \",'S1'!M$8)","v":" "},{"$f":"IF(ISTEXT('S1'!$N$13),NA(),'S1'!$N$13)","v":{"$error":"#N/A"}},null,{"$f":"IF(ISTEXT('S1'!$N$14),NA(),'S1'!$N$14)","v":{"$error":"#N/A"}},null,{"$f":"IF(ISTEXT('S1'!$N$15),NA(),'S1'!$N$15)","v":{"$error":"#N/A"}},null,{"$f":"IF(ISTEXT('S1'!$N$16),NA(),'S1'!$N$16)","v":{"$error":"#N/A"}},null,{"$f":"IF(ISTEXT('S1'!$N$17),NA(),'S1'!$N$17)","v":{"$error":"#N/A"}}]
[{"$f":"IF(ISBLANK('S1'!C$24),\" \",'S1'!C$24)","v":" "},{"$f":"IF(ISTEXT('S1'!$D$29),NA(),'S1'!$D$29)","v":{"$error":"#N/A"}},null,{"$f":"IF(ISTEXT('S1'!$D$30),NA(),'S1'!$D$30)","v":{"$error":"#N/A"}},null,{"$f":"IF(ISTEXT('S1'!$D$31),NA(),'S1'!$D$31)","v":{"$error":"#N/A"}},null,{"$f":"IF(ISTEXT('S1'!$D$32),NA(),'S1'!$D$32)","v":{"$error":"#N/A"}},null,{"$f":"IF(ISTEXT('S1'!$D$33),NA(),'S1'!$D$33)","v":{"$error":"#N/A"}}]
[{"$f":"IF(ISBLANK('S1'!E$24),\" \",'S1'!E$24)","v":" "},{"$f":"IF(ISTEXT('S1'!$F$29),NA(),'S1'!$F$29)","v":{"$error":"#N/A"}},null,{"$f":"IF(ISTEXT('S1'!$F$30),NA(),'S1'!$F$30)","v":{"$error":"#N/A"}},null,{"$f":"IF(ISTEXT('S1'!$F$31),NA(),'S1'!$F$31)","v":{"$error":"#N/A"}},null,{"$f":"IF(ISTEXT('S1'!$F$32),NA(),'S1'!$F$32)","v":{"$error":"#N/A"}},null,{"$f":"IF(ISTEXT('S1'!$F$33),NA(),'S1'!$F$33)","v":{"$error":"#N/A"}}]
[{"$f":"IF(ISBLANK('S1'!G$24),\" \",'S1'!G$24)","v":" "},{"$f":"IF(ISTEXT('S1'!$H$29),NA(),'S1'!$H$29)","v":{"$error":"#N/A"}},null,{"$f":"IF(ISTEXT('S1'!$H$30),NA(),'S1'!$H$30)","v":{"$error":"#N/A"}},null,{"$f":"IF(ISTEXT('S1'!$H$31),NA(),'S1'!$H$31)","v":{"$error":"#N/A"}},null,{"$f":"IF(ISTEXT('S1'!$H$32),NA(),'S1'!$H$32)","v":{"$error":"#N/A"}},null,{"$f":"IF(ISTEXT('S1'!$H$33),NA(),'S1'!$H$33)","v":{"$error":"#N/A"}}]
[{"$f":"IF(ISBLANK('S1'!I$24),\" \",'S1'!I$24)","v":" "},{"$f":"IF(ISTEXT('S1'!$J$29),NA(),'S1'!$J$29)","v":{"$error":"#N/A"}},null,{"$f":"IF(ISTEXT('S1'!$J$30),NA(),'S1'!$J$30)","v":{"$error":"#N/A"}},null,{"$f":"IF(ISTEXT('S1'!$J$31),NA(),'S1'!$J$31)","v":{"$error":"#N/A"}},null,{"$f":"IF(ISTEXT('S1'!$J$32),NA(),'S1'!$J$32)","v":{"$error":"#N/A"}},null,{"$f":"IF(ISTEXT('S1'!$J$33),NA(),'S1'!$J$33)","v":{"$error":"#N/A"}}]
[{"$f":"IF(ISBLANK('S1'!K$24),\" \",'S1'!K$24)","v":" "},{"$f":"IF(ISTEXT('S1'!$L$29),NA(),'S1'!$L$29)","v":{"$error":"#N/A"}},null,{"$f":"IF(ISTEXT('S1'!$L$30),NA(),'S1'!$L$30)","v":{"$error":"#N/A"}},null,{"$f":"IF(ISTEXT('S1'!$L$31),NA(),'S1'!$L$31)","v":{"$error":"#N/A"}},null,{"$f":"IF(ISTEXT('S1'!$L$32),NA(),'S1'!$L$32)","v":{"$error":"#N/A"}},null,{"$f":"IF(ISTEXT('S1'!$L$33),NA(),'S1'!$L$33)","v":{"$error":"#N/A"}}]
[{"$f":"IF(ISBLANK('S1'!M$24),\" \",'S1'!M$24)","v":" "},{"$f":"IF(ISTEXT('S1'!$N$29),NA(),'S1'!$N$29)","v":{"$error":"#N/A"}},null,{"$f":"IF(ISTEXT('S1'!$N$30),NA(),'S1'!$N$30)","v":{"$error":"#N/A"}},null,{"$f":"IF(ISTEXT('S1'!$N$31),NA(),'S1'!$N$31)","v":{"$error":"#N/A"}},null,{"$f":"IF(ISTEXT('S1'!$N$32),NA(),'S1'!$N$32)","v":{"$error":"#N/A"}},null,{"$f":"IF(ISTEXT('S1'!$N$33),NA(),'S1'!$N$33)","v":{"$error":"#N/A"}}]
[{"$f":"IF(ISBLANK('S2'!C$8),\" \",'S2'!C$8)","v":" "},{"$f":"IF(ISTEXT('S2'!$D$13),NA(),'S2'!$D$13)","v":{"$error":"#N/A"}},null,{"$f":"IF(ISTEXT('S2'!$D$14),NA(),'S2'!$D$14)","v":{"$error":"#N/A"}},null,{"$f":"IF(ISTEXT('S2'!$D$15),NA(),'S2'!$D$15)","v":{"$error":"#N/A"}},null,{"$f":"IF(ISTEXT('S2'!$D$16),NA(),'S2'!$D$16)","v":{"$error":"#N/A"}},null,{"$f":"IF(ISTEXT('S2'!$D$17),NA(),'S2'!$D$17)","v":{"$error":"#N/A"}}]
[{"$f":"IF(ISBLANK('S2'!E$8),\" \",'S2'!E$8)","v":" "},{"$f":"IF(ISTEXT('S2'!$F$13),NA(),'S2'!$F$13)","v":{"$error":"#N/A"}},null,{"$f":"IF(ISTEXT('S2'!$F$14),NA(),'S2'!$F$14)","v":{"$error":"#N/A"}},null,{"$f":"IF(ISTEXT('S2'!$F$15),NA(),'S2'!$F$15)","v":{"$error":"#N/A"}},null,{"$f":"IF(ISTEXT('S2'!$F$16),NA(),'S2'!$F$16)","v":{"$error":"#N/A"}},null,{"$f":"IF(ISTEXT('S2'!$F$17),NA(),'S2'!$F$17)","v":{"$error":"#N/A"}}]
[{"$f":"IF(ISBLANK('S2'!G$8),\" \",'S2'!G$8)","v":" "},{"$f":"IF(ISTEXT('S2'!$H$13),NA(),'S2'!$H$13)","v":{"$error":"#N/A"}},null,{"$f":"IF(ISTEXT('S2'!$H$14),NA(),'S2'!$H$14)","v":{"$error":"#N/A"}},null,{"$f":"IF(ISTEXT('S2'!$H$15),NA(),'S2'!$H$15)","v":{"$error":"#N/A"}},null,{"$f":"IF(ISTEXT('S2'!$H$16),NA(),'S2'!$H$16)","v":{"$error":"#N/A"}},null,{"$f":"IF(ISTEXT('S2'!$H$17),NA(),'S2'!$H$17)","v":{"$error":"#N/A"}}]
[{"$f":"IF(ISBLANK('S2'!I$8),\" \",'S2'!I$8)","v":" "},{"$f":"IF(ISTEXT('S2'!$J$13),NA(),'S2'!$J$13)","v":{"$error":"#N/A"}},null,{"$f":"IF(ISTEXT('S2'!$J$14),NA(),'S2'!$J$14)","v":{"$error":"#N/A"}},null,{"$f":"IF(ISTEXT('S2'!$J$15),NA(),'S2'!$J$15)","v":{"$error":"#N/A"}},null,{"$f":"IF(ISTEXT('S2'!$J$16),NA(),'S2'!$J$16)","v":{"$error":"#N/A"}},null,{"$f":"IF(ISTEXT('S2'!$J$17),NA(),'S2'!$J$17)","v":{"$error":"#N/A"}}]
[{"$f":"IF(ISBLANK('S2'!K$8),\" \",'S2'!K$8)","v":" "},{"$f":"IF(ISTEXT('S2'!$L$13),NA(),'S2'!$L$13)","v":{"$error":"#N/A"}},null,{"$f":"IF(ISTEXT('S2'!$L$14),NA(),'S2'!$L$14)","v":{"$error":"#N/A"}},null,{"$f":"IF(ISTEXT('S2'!$L$15),NA(),'S2'!$L$15)","v":{"$error":"#N/A"}},null,{"$f":"IF(ISTEXT('S2'!$L$16),NA(),'S2'!$L$16)","v":{"$error":"#N/A"}},null,{"$f":"IF(ISTEXT('S2'!$L$17),NA(),'S2'!$L$17)","v":{"$error":"#N/A"}}]
[{"$f":"IF(ISBLANK('S2'!M$8),\" \",'S2'!M$8)","v":" "},{"$f":"IF(ISTEXT('S2'!$N$13),NA(),'S2'!$N$13)","v":{"$error":"#N/A"}},null,{"$f":"IF(ISTEXT('S2'!$N$14),NA(),'S2'!$N$14)","v":{"$error":"#N/A"}},null,{"$f":"IF(ISTEXT('S2'!$N$15),NA(),'S2'!$N$15)","v":{"$error":"#N/A"}},null,{"$f":"IF(ISTEXT('S2'!$N$16),NA(),'S2'!$N$16)","v":{"$error":"#N/A"}},null,{"$f":"IF(ISTEXT('S2'!$N$17),NA(),'S2'!$N$17)","v":{"$error":"#N/A"}}]
[{"$f":"IF(ISBLANK('S2'!C$24),\" \",'S2'!C$24)","v":" "},{"$f":"IF(ISTEXT('S2'!$D$29),NA(),'S2'!$D$29)","v":{"$error":"#N/A"}},null,{"$f":"IF(ISTEXT('S2'!$D$30),NA(),'S2'!$D$30)","v":{"$error":"#N/A"}},null,{"$f":"IF(ISTEXT('S2'!$D$31),NA(),'S2'!$D$31)","v":{"$error":"#N/A"}},null,{"$f":"IF(ISTEXT('S2'!$D$32),NA(),'S2'!$D$32)","v":{"$error":"#N/A"}},null,{"$f":"IF(ISTEXT('S2'!$D$33),NA(),'S2'!$D$33)","v":{"$error":"#N/A"}}]
[{"$f":"IF(ISBLANK('S2'!E$24),\" \",'S2'!E$24)","v":" "},{"$f":"IF(ISTEXT('S2'!$F$29),NA(),'S2'!$F$29)","v":{"$error":"#N/A"}},null,{"$f":"IF(ISTEXT('S2'!$F$30),NA(),'S2'!$F$30)","v":{"$error":"#N/A"}},null,{"$f":"IF(ISTEXT('S2'!$F$31),NA(),'S2'!$F$31)","v":{"$error":"#N/A"}},null,{"$f":"IF(ISTEXT('S2'!$F$32),NA(),'S2'!$F$32)","v":{"$error":"#N/A"}},null,{"$f":"IF(ISTEXT('S2'!$F$33),NA(),'S2'!$F$33)","v":{"$error":"#N/A"}}]
[{"$f":"IF(ISBLANK('S2'!G$24),\" \",'S2'!G$24)","v":" "},{"$f":"IF(ISTEXT('S2'!$H$29),NA(),'S2'!$H$29)","v":{"$error":"#N/A"}},null,{"$f":"IF(ISTEXT('S2'!$H$30),NA(),'S2'!$H$30)","v":{"$error":"#N/A"}},null,{"$f":"IF(ISTEXT('S2'!$H$31),NA(),'S2'!$H$31)","v":{"$error":"#N/A"}},null,{"$f":"IF(ISTEXT('S2'!$H$32),NA(),'S2'!$H$32)","v":{"$error":"#N/A"}},null,{"$f":"IF(ISTEXT('S2'!$H$33),NA(),'S2'!$H$33)","v":{"$error":"#N/A"}}]
[{"$f":"IF(ISBLANK('S2'!I$24),\" \",'S2'!I$24)","v":" "},{"$f":"IF(ISTEXT('S2'!$J$29),NA(),'S2'!$J$29)","v":{"$error":"#N/A"}},null,{"$f":"IF(ISTEXT('S2'!$J$30),NA(),'S2'!$J$30)","v":{"$error":"#N/A"}},null,{"$f":"IF(ISTEXT('S2'!$J$31),NA(),'S2'!$J$31)","v":{"$error":"#N/A"}},null,{"$f":"IF(ISTEXT('S2'!$J$32),NA(),'S2'!$J$32)","v":{"$error":"#N/A"}},null,{"$f":"IF(ISTEXT('S2'!$J$33),NA(),'S2'!$J$33)","v":{"$error":"#N/A"}}]
[{"$f":"IF(ISBLANK('S2'!K$24),\" \",'S2'!K$24)","v":" "},{"$f":"IF(ISTEXT('S2'!$L$29),NA(),'S2'!$L$29)","v":{"$error":"#N/A"}},null,{"$f":"IF(ISTEXT('S2'!$L$30),NA(),'S2'!$L$30)","v":{"$error":"#N/A"}},null,{"$f":"IF(ISTEXT('S2'!$L$31),NA(),'S2'!$L$31)","v":{"$error":"#N/A"}},null,{"$f":"IF(ISTEXT('S2'!$L$32),NA(),'S2'!$L$32)","v":{"$error":"#N/A"}},null,{"$f":"IF(ISTEXT('S2'!$L$33),NA(),'S2'!$L$33)","v":{"$error":"#N/A"}}]
[{"$f":"IF(ISBLANK('S2'!M$24),\" \",'S2'!M$24)","v":" "},{"$f":"IF(ISTEXT('S2'!$N$29),NA(),'S2'!$N$29)","v":{"$error":"#N/A"}},null,{"$f":"IF(ISTEXT('S2'!$N$30),NA(),'S2'!$N$30)","v":{"$error":"#N/A"}},null,{"$f":"IF(ISTEXT('S2'!$N$31),NA(),'S2'!$N$31)","v":{"$error":"#N/A"}},null,{"$f":"IF(ISTEXT('S2'!$N$32),NA(),'S2'!$N$32)","v":{"$error":"#N/A"}},null,{"$f":"IF(ISTEXT('S2'!$N$33),NA(),'S2'!$N$33)","v":{"$error":"#N/A"}}]
[{"$f":"IF(ISBLANK('S3'!C$8),\" \",'S3'!C$8)","v":" "},{"$f":"IF(ISTEXT('S3'!$D$13),NA(),'S3'!$D$13)","v":{"$error":"#N/A"}},null,{"$f":"IF(ISTEXT('S3'!$D$14),NA(),'S3'!$D$14)","v":{"$error":"#N/A"}},null,{"$f":"IF(ISTEXT('S3'!$D$15),NA(),'S3'!$D$15)","v":{"$error":"#N/A"}},null,{"$f":"IF(ISTEXT('S3'!$D$16),NA(),'S3'!$D$16)","v":{"$error":"#N/A"}},null,{"$f":"IF(ISTEXT('S3'!$D$17),NA(),'S3'!$D$17)","v":{"$error":"#N/A"}}]
[{"$f":"IF(ISBLANK('S3'!E$8),\" \",'S3'!E$8)","v":" "},{"$f":"IF(ISTEXT('S3'!$F$13),NA(),'S3'!$F$13)","v":{"$error":"#N/A"}},null,{"$f":"IF(ISTEXT('S3'!$F$14),NA(),'S3'!$F$14)","v":{"$error":"#N/A"}},null,{"$f":"IF(ISTEXT('S3'!$F$15),NA(),'S3'!$F$15)","v":{"$error":"#N/A"}},null,{"$f":"IF(ISTEXT('S3'!$F$16),NA(),'S3'!$F$16)","v":{"$error":"#N/A"}},null,{"$f":"IF(ISTEXT('S3'!$F$17),NA(),'S3'!$F$17)","v":{"$error":"#N/A"}}]
[{"$f":"IF(ISBLANK('S3'!G$8),\" \",'S3'!G$8)","v":" "},{"$f":"IF(ISTEXT('S3'!$H$13),NA(),'S3'!$H$13)","v":{"$error":"#N/A"}},null,{"$f":"IF(ISTEXT('S3'!$H$14),NA(),'S3'!$H$14)","v":{"$error":"#N/A"}},null,{"$f":"IF(ISTEXT('S3'!$H$15),NA(),'S3'!$H$15)","v":{"$error":"#N/A"}},null,{"$f":"IF(ISTEXT('S3'!$H$16),NA(),'S3'!$H$16)","v":{"$error":"#N/A"}},null,{"$f":"IF(ISTEXT('S3'!$H$17),NA(),'S3'!$H$17)","v":{"$error":"#N/A"}}]
[{"$f":"IF(ISBLANK('S3'!I$8),\" \",'S3'!I$8)","v":" "},{"$f":"IF(ISTEXT('S3'!$J$13),NA(),'S3'!$J$13)","v":{"$error":"#N/A"}},null,{"$f":"IF(ISTEXT('S3'!$J$14),NA(),'S3'!$J$14)","v":{"$error":"#N/A"}},null,{"$f":"IF(ISTEXT('S3'!$J$15),NA(),'S3'!$J$15)","v":{"$error":"#N/A"}},null,{"$f":"IF(ISTEXT('S3'!$J$16),NA(),'S3'!$J$16)","v":{"$error":"#N/A"}},null,{"$f":"IF(ISTEXT('S3'!$J$17),NA(),'S3'!$J$17)","v":{"$error":"#N/A"}}]
[{"$f":"IF(ISBLANK('S3'!K$8),\" \",'S3'!K$8)","v":" "},{"$f":"IF(ISTEXT('S3'!$L$13),NA(),'S3'!$L$13)","v":{"$error":"#N/A"}},null,{"$f":"IF(ISTEXT('S3'!$L$14),NA(),'S3'!$L$14)","v":{"$error":"#N/A"}},null,{"$f":"IF(ISTEXT('S3'!$L$15),NA(),'S3'!$L$15)","v":{"$error":"#N/A"}},null,{"$f":"IF(ISTEXT('S3'!$L$16),NA(),'S3'!$L$16)","v":{"$error":"#N/A"}},null,{"$f":"IF(ISTEXT('S3'!$L$17),NA(),'S3'!$L$17)","v":{"$error":"#N/A"}}]
[{"$f":"IF(ISBLANK('S3'!M$8),\" \",'S3'!M$8)","v":" "},{"$f":"IF(ISTEXT('S3'!$N$13),NA(),'S3'!$N$13)","v":{"$error":"#N/A"}},null,{"$f":"IF(ISTEXT('S3'!$N$14),NA(),'S3'!$N$14)","v":{"$error":"#N/A"}},null,{"$f":"IF(ISTEXT('S3'!$N$15),NA(),'S3'!$N$15)","v":{"$error":"#N/A"}},null,{"$f":"IF(ISTEXT('S3'!$N$16),NA(),'S3'!$N$16)","v":{"$error":"#N/A"}},null,{"$f":"IF(ISTEXT('S3'!$N$17),NA(),'S3'!$N$17)","v":{"$error":"#N/A"}}]
[{"$f":"IF(ISBLANK('S3'!C$24),\" \",'S3'!C$24)","v":" "},{"$f":"IF(ISTEXT('S3'!$D$29),NA(),'S3'!$D$29)","v":{"$error":"#N/A"}},null,{"$f":"IF(ISTEXT('S3'!$D$30),NA(),'S3'!$D$30)","v":{"$error":"#N/A"}},null,{"$f":"IF(ISTEXT('S3'!$D$31),NA(),'S3'!$D$31)","v":{"$error":"#N/A"}},null,{"$f":"IF(ISTEXT('S3'!$D$32),NA(),'S3'!$D$32)","v":{"$error":"#N/A"}},null,{"$f":"IF(ISTEXT('S3'!$D$33),NA(),'S3'!$D$33)","v":{"$error":"#N/A"}}]
[{"$f":"IF(ISBLANK('S3'!E$24),\" \",'S3'!E$24)","v":" "},{"$f":"IF(ISTEXT('S3'!$F$29),NA(),'S3'!$F$29)","v":{"$error":"#N/A"}},null,{"$f":"IF(ISTEXT('S3'!$F$30),NA(),'S3'!$F$30)","v":{"$error":"#N/A"}},null,{"$f":"IF(ISTEXT('S3'!$F$31),NA(),'S3'!$F$31)","v":{"$error":"#N/A"}},null,{"$f":"IF(ISTEXT('S3'!$F$32),NA(),'S3'!$F$32)","v":{"$error":"#N/A"}},null,{"$f":"IF(ISTEXT('S3'!$F$33),NA(),'S3'!$F$33)","v":{"$error":"#N/A"}}]
[{"$f":"IF(ISBLANK('S3'!G$24),\" \",'S3'!G$24)","v":" "},{"$f":"IF(ISTEXT('S3'!$H$29),NA(),'S3'!$H$29)","v":{"$error":"#N/A"}},null,{"$f":"IF(ISTEXT('S3'!$H$30),NA(),'S3'!$H$30)","v":{"$error":"#N/A"}},null,{"$f":"IF(ISTEXT('S3'!$H$31),NA(),'S3'!$H$31)","v":{"$error":"#N/A"}},null,{"$f":"IF(ISTEXT('S3'!$H$32),NA(),'S3'!$H$32)","v":{"$error":"#N/A"}},null,{"$f":"IF(ISTEXT('S3'!$H$33),NA(),'S3'!$H$33)","v":{"$error":"#N/A"}}]
[{"$f":"IF(ISBLANK('S3'!I$24),\" \",'S3'!I$24)","v":" "},{"$f":"IF(ISTEXT('S3'!$J$29),NA(),'S3'!$J$29)","v":{"$error":"#N/A"}},null,{"$f":"IF(ISTEXT('S3'!$J$30),NA(),'S3'!$J$30)","v":{"$error":"#N/A"}},null,{"$f":"IF(ISTEXT('S3'!$J$31),NA(),'S3'!$J$31)","v":{"$error":"#N/A"}},null,{"$f":"IF(ISTEXT('S3'!$J$32),NA(),'S3'!$J$32)","v":{"$error":"#N/A"}},null,{"$f":"IF(ISTEXT('S3'!$J$33),NA(),'S3'!$J$33)","v":{"$error":"#N/A"}}]
[{"$f":"IF(ISBLANK('S3'!K$24),\" \",'S3'!K$24)","v":" "},{"$f":"IF(ISTEXT('S3'!$L$29),NA(),'S3'!$L$29)","v":{"$error":"#N/A"}},null,{"$f":"IF(ISTEXT('S3'!$L$30),NA(),'S3'!$L$30)","v":{"$error":"#N/A"}},null,{"$f":"IF(ISTEXT('S3'!$L$31),NA(),'S3'!$L$31)","v":{"$error":"#N/A"}},null,{"$f":"IF(ISTEXT('S3'!$L$32),NA(),'S3'!$L$32)","v":{"$error":"#N/A"}},null,{"$f":"IF(ISTEXT('S3'!$L$33),NA(),'S3'!$L$33)","v":{"$error":"#N/A"}}]
[{"$f":"IF(ISBLANK('S3'!M$24),\" \",'S3'!M$24)","v":" "},{"$f":"IF(ISTEXT('S3'!$N$29),NA(),'S3'!$N$29)","v":{"$error":"#N/A"}},null,{"$f":"IF(ISTEXT('S3'!$N$30),NA(),'S3'!$N$30)","v":{"$error":"#N/A"}},null,{"$f":"IF(ISTEXT('S3'!$N$31),NA(),'S3'!$N$31)","v":{"$error":"#N/A"}},null,{"$f":"IF(ISTEXT('S3'!$N$32),NA(),'S3'!$N$32)","v":{"$error":"#N/A"}},null,{"$f":"IF(ISTEXT('S3'!$N$33),NA(),'S3'!$N$33)","v":{"$error":"#N/A"}}]
[{"$f":"IF(ISBLANK('S4'!C$8),\" \",'S4'!C$8)","v":" "},{"$f":"IF(ISTEXT('S4'!$D$13),NA(),'S4'!$D$13)","v":{"$error":"#N/A"}},null,{"$f":"IF(ISTEXT('S4'!$D$14),NA(),'S4'!$D$14)","v":{"$error":"#N/A"}},null,{"$f":"IF(ISTEXT('S4'!$D$15),NA(),'S4'!$D$15)","v":{"$error":"#N/A"}},null,{"$f":"IF(ISTEXT('S4'!$D$16),NA(),'S4'!$D$16)","v":{"$error":"#N/A"}},null,{"$f":"IF(ISTEXT('S4'!$D$17),NA(),'S4'!$D$17)","v":{"$error":"#N/A"}}]
[{"$f":"IF(ISBLANK('S4'!E$8),\" \",'S4'!E$8)","v":" "},{"$f":"IF(ISTEXT('S4'!$F$13),NA(),'S4'!$F$13)","v":{"$error":"#N/A"}},null,{"$f":"IF(ISTEXT('S4'!$F$14),NA(),'S4'!$F$14)","v":{"$error":"#N/A"}},null,{"$f":"IF(ISTEXT('S4'!$F$15),NA(),'S4'!$F$15)","v":{"$error":"#N/A"}},null,{"$f":"IF(ISTEXT('S4'!$F$16),NA(),'S4'!$F$16)","v":{"$error":"#N/A"}},null,{"$f":"IF(ISTEXT('S4'!$F$17),NA(),'S4'!$F$17)","v":{"$error":"#N/A"}}]
[{"$f":"IF(ISBLANK('S4'!G$8),\" \",'S4'!G$8)","v":" "},{"$f":"IF(ISTEXT('S4'!$H$13),NA(),'S4'!$H$13)","v":{"$error":"#N/A"}},null,{"$f":"IF(ISTEXT('S4'!$H$14),NA(),'S4'!$H$14)","v":{"$error":"#N/A"}},null,{"$f":"IF(ISTEXT('S4'!$H$15),NA(),'S4'!$H$15)","v":{"$error":"#N/A"}},null,{"$f":"IF(ISTEXT('S4'!$H$16),NA(),'S4'!$H$16)","v":{"$error":"#N/A"}},null,{"$f":"IF(ISTEXT('S4'!$H$17),NA(),'S4'!$H$17)","v":{"$error":"#N/A"}}]
[{"$f":"IF(ISBLANK('S4'!I$8),\" \",'S4'!I$8)","v":" "},{"$f":"IF(ISTEXT('S4'!$J$13),NA(),'S4'!$J$13)","v":{"$error":"#N/A"}},null,{"$f":"IF(ISTEXT('S4'!$J$14),NA(),'S4'!$J$14)","v":{"$error":"#N/A"}},null,{"$f":"IF(ISTEXT('S4'!$J$15),NA(),'S4'!$J$15)","v":{"$error":"#N/A"}},null,{"$f":"IF(ISTEXT('S4'!$J$16),NA(),'S4'!$J$16)","v":{"$error":"#N/A"}},null,{"$f":"IF(ISTEXT('S4'!$J$17),NA(),'S4'!$J$17)","v":{"$error":"#N/A"}}]
[{"$f":"IF(ISBLANK('S4'!K$8),\" \",'S4'!K$8)","v":" "},{"$f":"IF(ISTEXT('S4'!$L$13),NA(),'S4'!$L$13)","v":{"$error":"#N/A"}},null,{"$f":"IF(ISTEXT('S4'!$L$14),NA(),'S4'!$L$14)","v":{"$error":"#N/A"}},null,{"$f":"IF(ISTEXT('S4'!$L$15),NA(),'S4'!$L$15)","v":{"$error":"#N/A"}},null,{"$f":"IF(ISTEXT('S4'!$L$16),NA(),'S4'!$L$16)","v":{"$error":"#N/A"}},null,{"$f":"IF(ISTEXT('S4'!$L$17),NA(),'S4'!$L$17)","v":{"$error":"#N/A"}}]
[{"$f":"IF(ISBLANK('S4'!M$8),\" \",'S4'!M$8)","v":" "},{"$f":"IF(ISTEXT('S4'!$N$13),NA(),'S4'!$N$13)","v":{"$error":"#N/A"}},null,{"$f":"IF(ISTEXT('S4'!$N$14),NA(),'S4'!$N$14)","v":{"$error":"#N/A"}},null,{"$f":"IF(ISTEXT('S4'!$N$15),NA(),'S4'!$N$15)","v":{"$error":"#N/A"}},null,{"$f":"IF(ISTEXT('S4'!$N$16),NA(),'S4'!$N$16)","v":{"$error":"#N/A"}},null,{"$f":"IF(ISTEXT('S4'!$N$17),NA(),'S4'!$N$17)","v":{"$error":"#N/A"}}]
[{"$f":"IF(ISBLANK('S4'!C$24),\" \",'S4'!C$24)","v":" "},{"$f":"IF(ISTEXT('S4'!$D$29),NA(),'S4'!$D$29)","v":{"$error":"#N/A"}},null,{"$f":"IF(ISTEXT('S4'!$D$30),NA(),'S4'!$D$30)","v":{"$error":"#N/A"}},null,{"$f":"IF(ISTEXT('S4'!$D$31),NA(),'S4'!$D$31)","v":{"$error":"#N/A"}},null,{"$f":"IF(ISTEXT('S4'!$D$32),NA(),'S4'!$D$32)","v":{"$error":"#N/A"}},null,{"$f":"IF(ISTEXT('S4'!$D$33),NA(),'S4'!$D$33)","v":{"$error":"#N/A"}}]
[{"$f":"IF(ISBLANK('S4'!E$24),\" \",'S4'!E$24)","v":" "},{"$f":"IF(ISTEXT('S4'!$F$29),NA(),'S4'!$F$29)","v":{"$error":"#N/A"}},null,{"$f":"IF(ISTEXT('S4'!$F$30),NA(),'S4'!$F$30)","v":{"$error":"#N/A"}},null,{"$f":"IF(ISTEXT('S4'!$F$31),NA(),'S4'!$F$31)","v":{"$error":"#N/A"}},null,{"$f":"IF(ISTEXT('S4'!$F$32),NA(),'S4'!$F$32)","v":{"$error":"#N/A"}},null,{"$f":"IF(ISTEXT('S4'!$F$33),NA(),'S4'!$F$33)","v":{"$error":"#N/A"}}]
[{"$f":"IF(ISBLANK('S4'!G$24),\" \",'S4'!G$24)","v":" "},{"$f":"IF(ISTEXT('S4'!$H$29),NA(),'S4'!$H$29)","v":{"$error":"#N/A"}},null,{"$f":"IF(ISTEXT('S4'!$H$30),NA(),'S4'!$H$30)","v":{"$error":"#N/A"}},null,{"$f":"IF(ISTEXT('S4'!$H$31),NA(),'S4'!$H$31)","v":{"$error":"#N/A"}},null,{"$f":"IF(ISTEXT('S4'!$H$32),NA(),'S4'!$H$32)","v":{"$error":"#N/A"}},null,{"$f":"IF(ISTEXT('S4'!$H$33),NA(),'S4'!$H$33)","v":{"$error":"#N/A"}}]
[{"$f":"IF(ISBLANK('S4'!I$24),\" \",'S4'!I$24)","v":" "},{"$f":"IF(ISTEXT('S4'!$J$29),NA(),'S4'!$J$29)","v":{"$error":"#N/A"}},null,{"$f":"IF(ISTEXT('S4'!$J$30),NA(),'S4'!$J$30)","v":{"$error":"#N/A"}},null,{"$f":"IF(ISTEXT('S4'!$J$31),NA(),'S4'!$J$31)","v":{"$error":"#N/A"}},null,{"$f":"IF(ISTEXT('S4'!$J$32),NA(),'S4'!$J$32)","v":{"$error":"#N/A"}},null,{"$f":"IF(ISTEXT('S4'!$J$33),NA(),'S4'!$J$33)","v":{"$error":"#N/A"}}]
[{"$f":"IF(ISBLANK('S4'!K$24),\" \",'S4'!K$24)","v":" "},{"$f":"IF(ISTEXT('S4'!$L$29),NA(),'S4'!$L$29)","v":{"$error":"#N/A"}},null,{"$f":"IF(ISTEXT('S4'!$L$30),NA(),'S4'!$L$30)","v":{"$error":"#N/A"}},null,{"$f":"IF(ISTEXT('S4'!$L$31),NA(),'S4'!$L$31)","v":{"$error":"#N/A"}},null,{"$f":"IF(ISTEXT('S4'!$L$32),NA(),'S4'!$L$32)","v":{"$error":"#N/A"}},null,{"$f":"IF(ISTEXT('S4'!$L$33),NA(),'S4'!$L$33)","v":{"$error":"#N/A"}}]
[{"$f":"IF(ISBLANK('S4'!M$24),\" \",'S4'!M$24)","v":" "},{"$f":"IF(ISTEXT('S4'!$N$29),NA(),'S4'!$N$29)","v":{"$error":"#N/A"}},null,{"$f":"IF(ISTEXT('S4'!$N$30),NA(),'S4'!$N$30)","v":{"$error":"#N/A"}},null,{"$f":"IF(ISTEXT('S4'!$N$31),NA(),'S4'!$N$31)","v":{"$error":"#N/A"}},null,{"$f":"IF(ISTEXT('S4'!$N$32),NA(),'S4'!$N$32)","v":{"$error":"#N/A"}},null,{"$f":"IF(ISTEXT('S4'!$N$33),NA(),'S4'!$N$33)","v":{"$error":"#N/A"}}]
[{"$f":"IF(ISBLANK('S5'!C$8),\" \",'S5'!C$8)","v":" "},{"$f":"IF(ISTEXT('S5'!$D$13),NA(),'S5'!$D$13)","v":{"$error":"#N/A"}},null,{"$f":"IF(ISTEXT('S5'!$D$14),NA(),'S5'!$D$14)","v":{"$error":"#N/A"}},null,{"$f":"IF(ISTEXT('S5'!$D$15),NA(),'S5'!$D$15)","v":{"$error":"#N/A"}},null,{"$f":"IF(ISTEXT('S5'!$D$16),NA(),'S5'!$D$16)","v":{"$error":"#N/A"}},null,{"$f":"IF(ISTEXT('S5'!$D$17),NA(),'S5'!$D$17)","v":{"$error":"#N/A"}}]
[{"$f":"IF(ISBLANK('S5'!E$8),\" \",'S5'!E$8)","v":" "},{"$f":"IF(ISTEXT('S5'!$F$13),NA(),'S5'!$F$13)","v":{"$error":"#N/A"}},null,{"$f":"IF(ISTEXT('S5'!$F$14),NA(),'S5'!$F$14)","v":{"$error":"#N/A"}},null,{"$f":"IF(ISTEXT('S5'!$F$15),NA(),'S5'!$F$15)","v":{"$error":"#N/A"}},null,{"$f":"IF(ISTEXT('S5'!$F$16),NA(),'S5'!$F$16)","v":{"$error":"#N/A"}},null,{"$f":"IF(ISTEXT('S5'!$F$17),NA(),'S5'!$F$17)","v":{"$error":"#N/A"}}]
[{"$f":"IF(ISBLANK('S5'!G$8),\" \",'S5'!G$8)","v":" "},{"$f":"IF(ISTEXT('S5'!$H$13),NA(),'S5'!$H$13)","v":{"$error":"#N/A"}},null,{"$f":"IF(ISTEXT('S5'!$H$14),NA(),'S5'!$H$14)","v":{"$error":"#N/A"}},null,{"$f":"IF(ISTEXT('S5'!$H$15),NA(),'S5'!$H$15)","v":{"$error":"#N/A"}},null,{"$f":"IF(ISTEXT('S5'!$H$16),NA(),'S5'!$H$16)","v":{"$error":"#N/A"}},null,{"$f":"IF(ISTEXT('S5'!$H$17),NA(),'S5'!$H$17)","v":{"$error":"#N/A"}}]
[{"$f":"IF(ISBLANK('S5'!I$8),\" \",'S5'!I$8)","v":" "},{"$f":"IF(ISTEXT('S5'!$J$13),NA(),'S5'!$J$13)","v":{"$error":"#N/A"}},null,{"$f":"IF(ISTEXT('S5'!$J$14),NA(),'S5'!$J$14)","v":{"$error":"#N/A"}},null,{"$f":"IF(ISTEXT('S5'!$J$15),NA(),'S5'!$J$15)","v":{"$error":"#N/A"}},null,{"$f":"IF(ISTEXT('S5'!$J$16),NA(),'S5'!$J$16)","v":{"$error":"#N/A"}},null,{"$f":"IF(ISTEXT('S5'!$J$17),NA(),'S5'!$J$17)","v":{"$error":"#N/A"}}]
[{"$f":"IF(ISBLANK('S5'!K$8),\" \",'S5'!K$8)","v":" "},{"$f":"IF(ISTEXT('S5'!$L$13),NA(),'S5'!$L$13)","v":{"$error":"#N/A"}},null,{"$f":"IF(ISTEXT('S5'!$L$14),NA(),'S5'!$L$14)","v":{"$error":"#N/A"}},null,{"$f":"IF(ISTEXT('S5'!$L$15),NA(),'S5'!$L$15)","v":{"$error":"#N/A"}},null,{"$f":"IF(ISTEXT('S5'!$L$16),NA(),'S5'!$L$16)","v":{"$error":"#N/A"}},null,{"$f":"IF(ISTEXT('S5'!$L$17),NA(),'S5'!$L$17)","v":{"$error":"#N/A"}}]
[{"$f":"IF(ISBLANK('S5'!M$8),\" \",'S5'!M$8)","v":" "},{"$f":"IF(ISTEXT('S5'!$N$13),NA(),'S5'!$N$13)","v":{"$error":"#N/A"}},null,{"$f":"IF(ISTEXT('S5'!$N$14),NA(),'S5'!$N$14)","v":{"$error":"#N/A"}},null,{"$f":"IF(ISTEXT('S5'!$N$15),NA(),'S5'!$N$15)","v":{"$error":"#N/A"}},null,{"$f":"IF(ISTEXT('S5'!$N$16),NA(),'S5'!$N$16)","v":{"$error":"#N/A"}},null,{"$f":"IF(ISTEXT('S5'!$N$17),NA(),'S5'!$N$17)","v":{"$error":"#N/A"}}]
[{"$f":"IF(ISBLANK('S5'!C$24),\" \",'S5'!C$24)","v":" "},{"$f":"IF(ISTEXT('S5'!$D$29),NA(),'S5'!$D$29)","v":{"$error":"#N/A"}},null,{"$f":"IF(ISTEXT('S5'!$D$30),NA(),'S5'!$D$30)","v":{"$error":"#N/A"}},null,{"$f":"IF(ISTEXT('S5'!$D$31),NA(),'S5'!$D$31)","v":{"$error":"#N/A"}},null,{"$f":"IF(ISTEXT('S5'!$D$32),NA(),'S5'!$D$32)","v":{"$error":"#N/A"}},null,{"$f":"IF(ISTEXT('S5'!$D$33),NA(),'S5'!$D$33)","v":{"$error":"#N/A"}}]
[{"$f":"IF(ISBLANK('S5'!E$24),\" \",'S5'!E$24)","v":" "},{"$f":"IF(ISTEXT('S5'!$F$29),NA(),'S5'!$F$29)","v":{"$error":"#N/A"}},null,{"$f":"IF(ISTEXT('S5'!$F$30),NA(),'S5'!$F$30)","v":{"$error":"#N/A"}},null,{"$f":"IF(ISTEXT('S5'!$F$31),NA(),'S5'!$F$31)","v":{"$error":"#N/A"}},null,{"$f":"IF(ISTEXT('S5'!$F$32),NA(),'S5'!$F$32)","v":{"$error":"#N/A"}},null,{"$f":"IF(ISTEXT('S5'!$F$33),NA(),'S5'!$F$33)","v":{"$error":"#N/A"}}]
[{"$f":"IF(ISBLANK('S5'!G$24),\" \",'S5'!G$24)","v":" "},{"$f":"IF(ISTEXT('S5'!$H$29),NA(),'S5'!$H$29)","v":{"$error":"#N/A"}},null,{"$f":"IF(ISTEXT('S5'!$H$30),NA(),'S5'!$H$30)","v":{"$error":"#N/A"}},null,{"$f":"IF(ISTEXT('S5'!$H$31),NA(),'S5'!$H$31)","v":{"$error":"#N/A"}},null,{"$f":"IF(ISTEXT('S5'!$H$32),NA(),'S5'!$H$32)","v":{"$error":"#N/A"}},null,{"$f":"IF(ISTEXT('S5'!$H$33),NA(),'S5'!$H$33)","v":{"$error":"#N/A"}}]
[{"$f":"IF(ISBLANK('S5'!I$24),\" \",'S5'!I$24)","v":" "},{"$f":"IF(ISTEXT('S5'!$J$29),NA(),'S5'!$J$29)","v":{"$error":"#N/A"}},null,{"$f":"IF(ISTEXT('S5'!$J$30),NA(),'S5'!$J$30)","v":{"$error":"#N/A"}},null,{"$f":"IF(ISTEXT('S5'!$J$31),NA(),'S5'!$J$31)","v":{"$error":"#N/A"}},null,{"$f":"IF(ISTEXT('S5'!$J$32),NA(),'S5'!$J$32)","v":{"$error":"#N/A"}},null,{"$f":"IF(ISTEXT('S5'!$J$33),NA(),'S5'!$J$33)","v":{"$error":"#N/A"}}]
[{"$f":"IF(ISBLANK('S5'!K$24),\" \",'S5'!K$24)","v":" "},{"$f":"IF(ISTEXT('S5'!$L$29),NA(),'S5'!$L$29)","v":{"$error":"#N/A"}},null,{"$f":"IF(ISTEXT('S5'!$L$30),NA(),'S5'!$L$30)","v":{"$error":"#N/A"}},null,{"$f":"IF(ISTEXT('S5'!$L$31),NA(),'S5'!$L$31)","v":{"$error":"#N/A"}},null,{"$f":"IF(ISTEXT('S5'!$L$32),NA(),'S5'!$L$32)","v":{"$error":"#N/A"}},null,{"$f":"IF(ISTEXT('S5'!$L$33),NA(),'S5'!$L$33)","v":{"$error":"#N/A"}}]
[{"$f":"IF(ISBLANK('S5'!M$24),\" \",'S5'!M$24)","v":" "},{"$f":"IF(ISTEXT('S5'!$N$29),NA(),'S5'!$N$29)","v":{"$error":"#N/A"}},null,{"$f":"IF(ISTEXT('S5'!$N$30),NA(),'S5'!$N$30)","v":{"$error":"#N/A"}},null,{"$f":"IF(ISTEXT('S5'!$N$31),NA(),'S5'!$N$31)","v":{"$error":"#N/A"}},null,{"$f":"IF(ISTEXT('S5'!$N$32),NA(),'S5'!$N$32)","v":{"$error":"#N/A"}},null,{"$f":"IF(ISTEXT('S5'!$N$33),NA(),'S5'!$N$33)","v":{"$error":"#N/A"}}]
[{"$f":"IF(ISBLANK('S6'!C$8),\" \",'S6'!C$8)","v":" "},{"$f":"IF(ISTEXT('S6'!$D$13),NA(),'S6'!$D$13)","v":{"$error":"#N/A"}},null,{"$f":"IF(ISTEXT('S6'!$D$14),NA(),'S6'!$D$14)","v":{"$error":"#N/A"}},null,{"$f":"IF(ISTEXT('S6'!$D$15),NA(),'S6'!$D$15)","v":{"$error":"#N/A"}},null,{"$f":"IF(ISTEXT('S6'!$D$16),NA(),'S6'!$D$16)","v":{"$error":"#N/A"}},null,{"$f":"IF(ISTEXT('S6'!$D$17),NA(),'S6'!$D$17)","v":{"$error":"#N/A"}}]
[{"$f":"IF(ISBLANK('S6'!E$8),\" \",'S6'!E$8)","v":" "},{"$f":"IF(ISTEXT('S6'!$F$13),NA(),'S6'!$F$13)","v":{"$error":"#N/A"}},null,{"$f":"IF(ISTEXT('S6'!$F$14),NA(),'S6'!$F$14)","v":{"$error":"#N/A"}},null,{"$f":"IF(ISTEXT('S6'!$F$15),NA(),'S6'!$F$15)","v":{"$error":"#N/A"}},null,{"$f":"IF(ISTEXT('S6'!$F$16),NA(),'S6'!$F$16)","v":{"$error":"#N/A"}},null,{"$f":"IF(ISTEXT('S6'!$F$17),NA(),'S6'!$F$17)","v":{"$error":"#N/A"}}]
[{"$f":"IF(ISBLANK('S6'!G$8),\" \",'S6'!G$8)","v":" "},{"$f":"IF(ISTEXT('S6'!$H$13),NA(),'S6'!$H$13)","v":{"$error":"#N/A"}},null,{"$f":"IF(ISTEXT('S6'!$H$14),NA(),'S6'!$H$14)","v":{"$error":"#N/A"}},null,{"$f":"IF(ISTEXT('S6'!$H$15),NA(),'S6'!$H$15)","v":{"$error":"#N/A"}},null,{"$f":"IF(ISTEXT('S6'!$H$16),NA(),'S6'!$H$16)","v":{"$error":"#N/A"}},null,{"$f":"IF(ISTEXT('S6'!$H$17),NA(),'S6'!$H$17)","v":{"$error":"#N/A"}}]
[{"$f":"IF(ISBLANK('S6'!I$8),\" \",'S6'!I$8)","v":" "},{"$f":"IF(ISTEXT('S6'!$J$13),NA(),'S6'!$J$13)","v":{"$error":"#N/A"}},null,{"$f":"IF(ISTEXT('S6'!$J$14),NA(),'S6'!$J$14)","v":{"$error":"#N/A"}},null,{"$f":"IF(ISTEXT('S6'!$J$15),NA(),'S6'!$J$15)","v":{"$error":"#N/A"}},null,{"$f":"IF(ISTEXT('S6'!$J$16),NA(),'S6'!$J$16)","v":{"$error":"#N/A"}},null,{"$f":"IF(ISTEXT('S6'!$J$17),NA(),'S6'!$J$17)","v":{"$error":"#N/A"}}]
[{"$f":"IF(ISBLANK('S6'!K$8),\" \",'S6'!K$8)","v":" "},{"$f":"IF(ISTEXT('S6'!$L$13),NA(),'S6'!$L$13)","v":{"$error":"#N/A"}},null,{"$f":"IF(ISTEXT('S6'!$L$14),NA(),'S6'!$L$14)","v":{"$error":"#N/A"}},null,{"$f":"IF(ISTEXT('S6'!$L$15),NA(),'S6'!$L$15)","v":{"$error":"#N/A"}},null,{"$f":"IF(ISTEXT('S6'!$L$16),NA(),'S6'!$L$16)","v":{"$error":"#N/A"}},null,{"$f":"IF(ISTEXT('S6'!$L$17),NA(),'S6'!$L$17)","v":{"$error":"#N/A"}}]
[{"$f":"IF(ISBLANK('S6'!M$8),\" \",'S6'!M$8)","v":" "},{"$f":"IF(ISTEXT('S6'!$N$13),NA(),'S6'!$N$13)","v":{"$error":"#N/A"}},null,{"$f":"IF(ISTEXT('S6'!$N$14),NA(),'S6'!$N$14)","v":{"$error":"#N/A"}},null,{"$f":"IF(ISTEXT('S6'!$N$15),NA(),'S6'!$N$15)","v":{"$error":"#N/A"}},null,{"$f":"IF(ISTEXT('S6'!$N$16),NA(),'S6'!$N$16)","v":{"$error":"#N/A"}},null,{"$f":"IF(ISTEXT('S6'!$N$17),NA(),'S6'!$N$17)","v":{"$error":"#N/A"}}]
[{"$f":"IF(ISBLANK('S6'!C$24),\" \",'S6'!C$24)","v":" "},{"$f":"IF(ISTEXT('S6'!$D$29),NA(),'S6'!$D$29)","v":{"$error":"#N/A"}},null,{"$f":"IF(ISTEXT('S6'!$D$30),NA(),'S6'!$D$30)","v":{"$error":"#N/A"}},null,{"$f":"IF(ISTEXT('S6'!$D$31),NA(),'S6'!$D$31)","v":{"$error":"#N/A"}},null,{"$f":"IF(ISTEXT('S6'!$D$32),NA(),'S6'!$D$32)","v":{"$error":"#N/A"}},null,{"$f":"IF(ISTEXT('S6'!$D$33),NA(),'S6'!$D$33)","v":{"$error":"#N/A"}}]
[{"$f":"IF(ISBLANK('S6'!E$24),\" \",'S6'!E$24)","v":" "},{"$f":"IF(ISTEXT('S6'!$F$29),NA(),'S6'!$F$29)","v":{"$error":"#N/A"}},null,{"$f":"IF(ISTEXT('S6'!$F$30),NA(),'S6'!$F$30)","v":{"$error":"#N/A"}},null,{"$f":"IF(ISTEXT('S6'!$F$31),NA(),'S6'!$F$31)","v":{"$error":"#N/A"}},null,{"$f":"IF(ISTEXT('S6'!$F$32),NA(),'S6'!$F$32)","v":{"$error":"#N/A"}},null,{"$f":"IF(ISTEXT('S6'!$F$33),NA(),'S6'!$F$33)","v":{"$error":"#N/A"}}]
[{"$f":"IF(ISBLANK('S6'!G$24),\" \",'S6'!G$24)","v":" "},{"$f":"IF(ISTEXT('S6'!$H$29),NA(),'S6'!$H$29)","v":{"$error":"#N/A"}},null,{"$f":"IF(ISTEXT('S6'!$H$30),NA(),'S6'!$H$30)","v":{"$error":"#N/A"}},null,{"$f":"IF(ISTEXT('S6'!$H$31),NA(),'S6'!$H$31)","v":{"$error":"#N/A"}},null,{"$f":"IF(ISTEXT('S6'!$H$32),NA(),'S6'!$H$32)","v":{"$error":"#N/A"}},null,{"$f":"IF(ISTEXT('S6'!$H$33),NA(),'S6'!$H$33)","v":{"$error":"#N/A"}}]
[{"$f":"IF(ISBLANK('S6'!I$24),\" \",'S6'!I$24)","v":" "},{"$f":"IF(ISTEXT('S6'!$J$29),NA(),'S6'!$J$29)","v":{"$error":"#N/A"}},null,{"$f":"IF(ISTEXT('S6'!$J$30),NA(),'S6'!$J$30)","v":{"$error":"#N/A"}},null,{"$f":"IF(ISTEXT('S6'!$J$31),NA(),'S6'!$J$31)","v":{"$error":"#N/A"}},null,{"$f":"IF(ISTEXT('S6'!$J$32),NA(),'S6'!$J$32)","v":{"$error":"#N/A"}},null,{"$f":"IF(ISTEXT('S6'!$J$33),NA(),'S6'!$J$33)","v":{"$error":"#N/A"}}]
[{"$f":"IF(ISBLANK('S6'!K$24),\" \",'S6'!K$24)","v":" "},{"$f":"IF(ISTEXT('S6'!$L$29),NA(),'S6'!$L$29)","v":{"$error":"#N/A"}},null,{"$f":"IF(ISTEXT('S6'!$L$30),NA(),'S6'!$L$30)","v":{"$error":"#N/A"}},null,{"$f":"IF(ISTEXT('S6'!$L$31),NA(),'S6'!$L$31)","v":{"$error":"#N/A"}},null,{"$f":"IF(ISTEXT('S6'!$L$32),NA(),'S6'!$L$32)","v":{"$error":"#N/A"}},null,{"$f":"IF(ISTEXT('S6'!$L$33),NA(),'S6'!$L$33)","v":{"$error":"#N/A"}}]
[{"$f":"IF(ISBLANK('S6'!M$24),\" \",'S6'!M$24)","v":" "},{"$f":"IF(ISTEXT('S6'!$N$29),NA(),'S6'!$N$29)","v":{"$error":"#N/A"}},null,{"$f":"IF(ISTEXT('S6'!$N$30),NA(),'S6'!$N$30)","v":{"$error":"#N/A"}},null,{"$f":"IF(ISTEXT('S6'!$N$31),NA(),'S6'!$N$31)","v":{"$error":"#N/A"}},null,{"$f":"IF(ISTEXT('S6'!$N$32),NA(),'S6'!$N$32)","v":{"$error":"#N/A"}},null,{"$f":"IF(ISTEXT('S6'!$N$33),NA(),'S6'!$N$33)","v":{"$error":"#N/A"}}]
[{"$f":"IF(ISBLANK('S7'!C$8),\" \",'S7'!C$8)","v":" "},{"$f":"IF(ISTEXT('S7'!$D$13),NA(),'S7'!$D$13)","v":{"$error":"#N/A"}},null,{"$f":"IF(ISTEXT('S7'!$D$14),NA(),'S7'!$D$14)","v":{"$error":"#N/A"}},null,{"$f":"IF(ISTEXT('S7'!$D$15),NA(),'S7'!$D$15)","v":{"$error":"#N/A"}},null,{"$f":"IF(ISTEXT('S7'!$D$16),NA(),'S7'!$D$16)","v":{"$error":"#N/A"}},null,{"$f":"IF(ISTEXT('S7'!$D$17),NA(),'S7'!$D$17)","v":{"$error":"#N/A"}}]
[{"$f":"IF(ISBLANK('S7'!E$8),\" \",'S7'!E$8)","v":" "},{"$f":"IF(ISTEXT('S7'!$F$13),NA(),'S7'!$F$13)","v":{"$error":"#N/A"}},null,{"$f":"IF(ISTEXT('S7'!$F$14),NA(),'S7'!$F$14)","v":{"$error":"#N/A"}},null,{"$f":"IF(ISTEXT('S7'!$F$15),NA(),'S7'!$F$15)","v":{"$error":"#N/A"}},null,{"$f":"IF(ISTEXT('S7'!$F$16),NA(),'S7'!$F$16)","v":{"$error":"#N/A"}},null,{"$f":"IF(ISTEXT('S7'!$F$17),NA(),'S7'!$F$17)","v":{"$error":"#N/A"}}]
[{"$f":"IF(ISBLANK('S7'!G$8),\" \",'S7'!G$8)","v":" "},{"$f":"IF(ISTEXT('S7'!$H$13),NA(),'S7'!$H$13)","v":{"$error":"#N/A"}},null,{"$f":"IF(ISTEXT('S7'!$H$14),NA(),'S7'!$H$14)","v":{"$error":"#N/A"}},null,{"$f":"IF(ISTEXT('S7'!$H$15),NA(),'S7'!$H$15)","v":{"$error":"#N/A"}},null,{"$f":"IF(ISTEXT('S7'!$H$16),NA(),'S7'!$H$16)","v":{"$error":"#N/A"}},null,{"$f":"IF(ISTEXT('S7'!$H$17),NA(),'S7'!$H$17)","v":{"$error":"#N/A"}}]
[{"$f":"IF(ISBLANK('S7'!I$8),\" \",'S7'!I$8)","v":" "},{"$f":"IF(ISTEXT('S7'!$J$13),NA(),'S7'!$J$13)","v":{"$error":"#N/A"}},null,{"$f":"IF(ISTEXT('S7'!$J$14),NA(),'S7'!$J$14)","v":{"$error":"#N/A"}},null,{"$f":"IF(ISTEXT('S7'!$J$15),NA(),'S7'!$J$15)","v":{"$error":"#N/A"}},null,{"$f":"IF(ISTEXT('S7'!$J$16),NA(),'S7'!$J$16)","v":{"$error":"#N/A"}},null,{"$f":"IF(ISTEXT('S7'!$J$17),NA(),'S7'!$J$17)","v":{"$error":"#N/A"}}]
[{"$f":"IF(ISBLANK('S7'!K$8),\" \",'S7'!K$8)","v":" "},{"$f":"IF(ISTEXT('S7'!$L$13),NA(),'S7'!$L$13)","v":{"$error":"#N/A"}},null,{"$f":"IF(ISTEXT('S7'!$L$14),NA(),'S7'!$L$14)","v":{"$error":"#N/A"}},null,{"$f":"IF(ISTEXT('S7'!$L$15),NA(),'S7'!$L$15)","v":{"$error":"#N/A"}},null,{"$f":"IF(ISTEXT('S7'!$L$16),NA(),'S7'!$L$16)","v":{"$error":"#N/A"}},null,{"$f":"IF(ISTEXT('S7'!$L$17),NA(),'S7'!$L$17)","v":{"$error":"#N/A"}}]
[{"$f":"IF(ISBLANK('S7'!M$8),\" \",'S7'!M$8)","v":" "},{"$f":"IF(ISTEXT('S7'!$N$13),NA(),'S7'!$N$13)","v":{"$error":"#N/A"}},null,{"$f":"IF(ISTEXT('S7'!$N$14),NA(),'S7'!$N$14)","v":{"$error":"#N/A"}},null,{"$f":"IF(ISTEXT('S7'!$N$15),NA(),'S7'!$N$15)","v":{"$error":"#N/A"}},null,{"$f":"IF(ISTEXT('S7'!$N$16),NA(),'S7'!$N$16)","v":{"$error":"#N/A"}},null,{"$f":"IF(ISTEXT('S7'!$N$17),NA(),'S7'!$N$17)","v":{"$error":"#N/A"}}]
[{"$f":"IF(ISBLANK('S7'!C$24),\" \",'S7'!C$24)","v":" "},{"$f":"IF(ISTEXT('S7'!$D$29),NA(),'S7'!$D$29)","v":{"$error":"#N/A"}},null,{"$f":"IF(ISTEXT('S7'!$D$30),NA(),'S7'!$D$30)","v":{"$error":"#N/A"}},null,{"$f":"IF(ISTEXT('S7'!$D$31),NA(),'S7'!$D$31)","v":{"$error":"#N/A"}},null,{"$f":"IF(ISTEXT('S7'!$D$32),NA(),'S7'!$D$32)","v":{"$error":"#N/A"}},null,{"$f":"IF(ISTEXT('S7'!$D$33),NA(),'S7'!$D$33)","v":{"$error":"#N/A"}}]
[{"$f":"IF(ISBLANK('S7'!E$24),\" \",'S7'!E$24)","v":" "},{"$f":"IF(ISTEXT('S7'!$F$29),NA(),'S7'!$F$29)","v":{"$error":"#N/A"}},null,{"$f":"IF(ISTEXT('S7'!$F$30),NA(),'S7'!$F$30)","v":{"$error":"#N/A"}},null,{"$f":"IF(ISTEXT('S7'!$F$31),NA(),'S7'!$F$31)","v":{"$error":"#N/A"}},null,{"$f":"IF(ISTEXT('S7'!$F$32),NA(),'S7'!$F$32)","v":{"$error":"#N/A"}},null,{"$f":"IF(ISTEXT('S7'!$F$33),NA(),'S7'!$F$33)","v":{"$error":"#N/A"}}]
[{"$f":"IF(ISBLANK('S7'!G$24),\" \",'S7'!G$24)","v":" "},{"$f":"IF(ISTEXT('S7'!$H$29),NA(),'S7'!$H$29)","v":{"$error":"#N/A"}},null,{"$f":"IF(ISTEXT('S7'!$H$30),NA(),'S7'!$H$30)","v":{"$error":"#N/A"}},null,{"$f":"IF(ISTEXT('S7'!$H$31),NA(),'S7'!$H$31)","v":{"$error":"#N/A"}},null,{"$f":"IF(ISTEXT('S7'!$H$32),NA(),'S7'!$H$32)","v":{"$error":"#N/A"}},null,{"$f":"IF(ISTEXT('S7'!$H$33),NA(),'S7'!$H$33)","v":{"$error":"#N/A"}}]
[{"$f":"IF(ISBLANK('S7'!I$24),\" \",'S7'!I$24)","v":" "},{"$f":"IF(ISTEXT('S7'!$J$29),NA(),'S7'!$J$29)","v":{"$error":"#N/A"}},null,{"$f":"IF(ISTEXT('S7'!$J$30),NA(),'S7'!$J$30)","v":{"$error":"#N/A"}},null,{"$f":"IF(ISTEXT('S7'!$J$31),NA(),'S7'!$J$31)","v":{"$error":"#N/A"}},null,{"$f":"IF(ISTEXT('S7'!$J$32),NA(),'S7'!$J$32)","v":{"$error":"#N/A"}},null,{"$f":"IF(ISTEXT('S7'!$J$33),NA(),'S7'!$J$33)","v":{"$error":"#N/A"}}]
[{"$f":"IF(ISBLANK('S7'!K$24),\" \",'S7'!K$24)","v":" "},{"$f":"IF(ISTEXT('S7'!$L$29),NA(),'S7'!$L$29)","v":{"$error":"#N/A"}},null,{"$f":"IF(ISTEXT('S7'!$L$30),NA(),'S7'!$L$30)","v":{"$error":"#N/A"}},null,{"$f":"IF(ISTEXT('S7'!$L$31),NA(),'S7'!$L$31)","v":{"$error":"#N/A"}},null,{"$f":"IF(ISTEXT('S7'!$L$32),NA(),'S7'!$L$32)","v":{"$error":"#N/A"}},null,{"$f":"IF(ISTEXT('S7'!$L$33),NA(),'S7'!$L$33)","v":{"$error":"#N/A"}}]
[{"$f":"IF(ISBLANK('S7'!M$24),\" \",'S7'!M$24)","v":" "},{"$f":"IF(ISTEXT('S7'!$N$29),NA(),'S7'!$N$29)","v":{"$error":"#N/A"}},null,{"$f":"IF(ISTEXT('S7'!$N$30),NA(),'S7'!$N$30)","v":{"$error":"#N/A"}},null,{"$f":"IF(ISTEXT('S7'!$N$31),NA(),'S7'!$N$31)","v":{"$error":"#N/A"}},null,{"$f":"IF(ISTEXT('S7'!$N$32),NA(),'S7'!$N$32)","v":{"$error":"#N/A"}},null,{"$f":"IF(ISTEXT('S7'!$N$33),NA(),'S7'!$N$33)","v":{"$error":"#N/A"}}]
[{"$f":"IF(ISBLANK('S8'!C$8),\" \",'S8'!C$8)","v":" "},{"$f":"IF(ISTEXT('S8'!$D$13),NA(),'S8'!$D$13)","v":{"$error":"#N/A"}},null,{"$f":"IF(ISTEXT('S8'!$D$14),NA(),'S8'!$D$14)","v":{"$error":"#N/A"}},null,{"$f":"IF(ISTEXT('S8'!$D$15),NA(),'S8'!$D$15)","v":{"$error":"#N/A"}},null,{"$f":"IF(ISTEXT('S8'!$D$16),NA(),'S8'!$D$16)","v":{"$error":"#N/A"}},null,{"$f":"IF(ISTEXT('S8'!$D$17),NA(),'S8'!$D$17)","v":{"$error":"#N/A"}}]
[{"$f":"IF(ISBLANK('S8'!E$8),\" \",'S8'!E$8)","v":" "},{"$f":"IF(ISTEXT('S8'!$F$13),NA(),'S8'!$F$13)","v":{"$error":"#N/A"}},null,{"$f":"IF(ISTEXT('S8'!$F$14),NA(),'S8'!$F$14)","v":{"$error":"#N/A"}},null,{"$f":"IF(ISTEXT('S8'!$F$15),NA(),'S8'!$F$15)","v":{"$error":"#N/A"}},null,{"$f":"IF(ISTEXT('S8'!$F$16),NA(),'S8'!$F$16)","v":{"$error":"#N/A"}},null,{"$f":"IF(ISTEXT('S8'!$F$17),NA(),'S8'!$F$17)","v":{"$error":"#N/A"}}]
[{"$f":"IF(ISBLANK('S8'!G$8),\" \",'S8'!G$8)","v":" "},{"$f":"IF(ISTEXT('S8'!$H$13),NA(),'S8'!$H$13)","v":{"$error":"#N/A"}},null,{"$f":"IF(ISTEXT('S8'!$H$14),NA(),'S8'!$H$14)","v":{"$error":"#N/A"}},null,{"$f":"IF(ISTEXT('S8'!$H$15),NA(),'S8'!$H$15)","v":{"$error":"#N/A"}},null,{"$f":"IF(ISTEXT('S8'!$H$16),NA(),'S8'!$H$16)","v":{"$error":"#N/A"}},null,{"$f":"IF(ISTEXT('S8'!$H$17),NA(),'S8'!$H$17)","v":{"$error":"#N/A"}}]
[{"$f":"IF(ISBLANK('S8'!I$8),\" \",'S8'!I$8)","v":" "},{"$f":"IF(ISTEXT('S8'!$J$13),NA(),'S8'!$J$13)","v":{"$error":"#N/A"}},null,{"$f":"IF(ISTEXT('S8'!$J$14),NA(),'S8'!$J$14)","v":{"$error":"#N/A"}},null,{"$f":"IF(ISTEXT('S8'!$J$15),NA(),'S8'!$J$15)","v":{"$error":"#N/A"}},null,{"$f":"IF(ISTEXT('S8'!$J$16),NA(),'S8'!$J$16)","v":{"$error":"#N/A"}},null,{"$f":"IF(ISTEXT('S8'!$J$17),NA(),'S8'!$J$17)","v":{"$error":"#N/A"}}]
[{"$f":"IF(ISBLANK('S8'!K$8),\" \",'S8'!K$8)","v":" "},{"$f":"IF(ISTEXT('S8'!$L$13),NA(),'S8'!$L$13)","v":{"$error":"#N/A"}},null,{"$f":"IF(ISTEXT('S8'!$L$14),NA(),'S8'!$L$14)","v":{"$error":"#N/A"}},null,{"$f":"IF(ISTEXT('S8'!$L$15),NA(),'S8'!$L$15)","v":{"$error":"#N/A"}},null,{"$f":"IF(ISTEXT('S8'!$L$16),NA(),'S8'!$L$16)","v":{"$error":"#N/A"}},null,{"$f":"IF(ISTEXT('S8'!$L$17),NA(),'S8'!$L$17)","v":{"$error":"#N/A"}}]
[{"$f":"IF(ISBLANK('S8'!M$8),\" \",'S8'!M$8)","v":" "},{"$f":"IF(ISTEXT('S8'!$N$13),NA(),'S8'!$N$13)","v":{"$error":"#N/A"}},null,{"$f":"IF(ISTEXT('S8'!$N$14),NA(),'S8'!$N$14)","v":{"$error":"#N/A"}},null,{"$f":"IF(ISTEXT('S8'!$N$15),NA(),'S8'!$N$15)","v":{"$error":"#N/A"}},null,{"$f":"IF(ISTEXT('S8'!$N$16),NA(),'S8'!$N$16)","v":{"$error":"#N/A"}},null,{"$f":"IF(ISTEXT('S8'!$N$17),NA(),'S8'!$N$17)","v":{"$error":"#N/A"}}]
[{"$f":"IF(ISBLANK('S8'!C$24),\" \",'S8'!C$24)","v":" "},{"$f":"IF(ISTEXT('S8'!$D$29),NA(),'S8'!$D$29)","v":{"$error":"#N/A"}},null,{"$f":"IF(ISTEXT('S8'!$D$30),NA(),'S8'!$D$30)","v":{"$error":"#N/A"}},null,{"$f":"IF(ISTEXT('S8'!$D$31),NA(),'S8'!$D$31)","v":{"$error":"#N/A"}},null,{"$f":"IF(ISTEXT('S8'!$D$32),NA(),'S8'!$D$32)","v":{"$error":"#N/A"}},null,{"$f":"IF(ISTEXT('S8'!$D$33),NA(),'S8'!$D$33)","v":{"$error":"#N/A"}}]
[{"$f":"IF(ISBLANK('S8'!E$24),\" \",'S8'!E$24)","v":" "},{"$f":"IF(ISTEXT('S8'!$F$29),NA(),'S8'!$F$29)","v":{"$error":"#N/A"}},null,{"$f":"IF(ISTEXT('S8'!$F$30),NA(),'S8'!$F$30)","v":{"$error":"#N/A"}},null,{"$f":"IF(ISTEXT('S8'!$F$31),NA(),'S8'!$F$31)","v":{"$error":"#N/A"}},null,{"$f":"IF(ISTEXT('S8'!$F$32),NA(),'S8'!$F$32)","v":{"$error":"#N/A"}},null,{"$f":"IF(ISTEXT('S8'!$F$33),NA(),'S8'!$F$33)","v":{"$error":"#N/A"}}]
[{"$f":"IF(ISBLANK('S8'!G$24),\" \",'S8'!G$24)","v":" "},{"$f":"IF(ISTEXT('S8'!$H$29),NA(),'S8'!$H$29)","v":{"$error":"#N/A"}},null,{"$f":"IF(ISTEXT('S8'!$H$30),NA(),'S8'!$H$30)","v":{"$error":"#N/A"}},null,{"$f":"IF(ISTEXT('S8'!$H$31),NA(),'S8'!$H$31)","v":{"$error":"#N/A"}},null,{"$f":"IF(ISTEXT('S8'!$H$32),NA(),'S8'!$H$32)","v":{"$error":"#N/A"}},null,{"$f":"IF(ISTEXT('S8'!$H$33),NA(),'S8'!$H$33)","v":{"$error":"#N/A"}}]
[{"$f":"IF(ISBLANK('S8'!I$24),\" \",'S8'!I$24)","v":" "},{"$f":"IF(ISTEXT('S8'!$J$29),NA(),'S8'!$J$29)","v":{"$error":"#N/A"}},null,{"$f":"IF(ISTEXT('S8'!$J$30),NA(),'S8'!$J$30)","v":{"$error":"#N/A"}},null,{"$f":"IF(ISTEXT('S8'!$J$31),NA(),'S8'!$J$31)","v":{"$error":"#N/A"}},null,{"$f":"IF(ISTEXT('S8'!$J$32),NA(),'S8'!$J$32)","v":{"$error":"#N/A"}},null,{"$f":"IF(ISTEXT('S8'!$J$33),NA(),'S8'!$J$33)","v":{"$error":"#N/A"}}]
[{"$f":"IF(ISBLANK('S8'!K$24),\" \",'S8'!K$24)","v":" "},{"$f":"IF(ISTEXT('S8'!$L$29),NA(),'S8'!$L$29)","v":{"$error":"#N/A"}},null,{"$f":"IF(ISTEXT('S8'!$L$30),NA(),'S8'!$L$30)","v":{"$error":"#N/A"}},null,{"$f":"IF(ISTEXT('S8'!$L$31),NA(),'S8'!$L$31)","v":{"$error":"#N/A"}},null,{"$f":"IF(ISTEXT('S8'!$L$32),NA(),'S8'!$L$32)","v":{"$error":"#N/A"}},null,{"$f":"IF(ISTEXT('S8'!$L$33),NA(),'S8'!$L$33)","v":{"$error":"#N/A"}}]
[{"$f":"IF(ISBLANK('S8'!M$24),\" \",'S8'!M$24)","v":" "},{"$f":"IF(ISTEXT('S8'!$N$29),NA(),'S8'!$N$29)","v":{"$error":"#N/A"}},null,{"$f":"IF(ISTEXT('S8'!$N$30),NA(),'S8'!$N$30)","v":{"$error":"#N/A"}},null,{"$f":"IF(ISTEXT('S8'!$N$31),NA(),'S8'!$N$31)","v":{"$error":"#N/A"}},null,{"$f":"IF(ISTEXT('S8'!$N$32),NA(),'S8'!$N$32)","v":{"$error":"#N/A"}},null,{"$f":"IF(ISTEXT('S8'!$N$33),NA(),'S8'!$N$33)","v":{"$error":"#N/A"}}]
[{"$f":"IF(ISBLANK('S9'!C$8),\" \",'S9'!C$8)","v":" "},{"$f":"IF(ISTEXT('S9'!$D$13),NA(),'S9'!$D$13)","v":{"$error":"#N/A"}},null,{"$f":"IF(ISTEXT('S9'!$D$14),NA(),'S9'!$D$14)","v":{"$error":"#N/A"}},null,{"$f":"IF(ISTEXT('S9'!$D$15),NA(),'S9'!$D$15)","v":{"$error":"#N/A"}},null,{"$f":"IF(ISTEXT('S9'!$D$16),NA(),'S9'!$D$16)","v":{"$error":"#N/A"}},null,{"$f":"IF(ISTEXT('S9'!$D$17),NA(),'S9'!$D$17)","v":{"$error":"#N/A"}}]
[{"$f":"IF(ISBLANK('S9'!E$8),\" \",'S9'!E$8)","v":" "},{"$f":"IF(ISTEXT('S9'!$F$13),NA(),'S9'!$F$13)","v":{"$error":"#N/A"}},null,{"$f":"IF(ISTEXT('S9'!$F$14),NA(),'S9'!$F$14)","v":{"$error":"#N/A"}},null,{"$f":"IF(ISTEXT('S9'!$F$15),NA(),'S9'!$F$15)","v":{"$error":"#N/A"}},null,{"$f":"IF(ISTEXT('S9'!$F$16),NA(),'S9'!$F$16)","v":{"$error":"#N/A"}},null,{"$f":"IF(ISTEXT('S9'!$F$17),NA(),'S9'!$F$17)","v":{"$error":"#N/A"}}]
[{"$f":"IF(ISBLANK('S9'!G$8),\" \",'S9'!G$8)","v":" "},{"$f":"IF(ISTEXT('S9'!$H$13),NA(),'S9'!$H$13)","v":{"$error":"#N/A"}},null,{"$f":"IF(ISTEXT('S9'!$H$14),NA(),'S9'!$H$14)","v":{"$error":"#N/A"}},null,{"$f":"IF(ISTEXT('S9'!$H$15),NA(),'S9'!$H$15)","v":{"$error":"#N/A"}},null,{"$f":"IF(ISTEXT('S9'!$H$16),NA(),'S9'!$H$16)","v":{"$error":"#N/A"}},null,{"$f":"IF(ISTEXT('S9'!$H$17),NA(),'S9'!$H$17)","v":{"$error":"#N/A"}}]
[{"$f":"IF(ISBLANK('S9'!I$8),\" \",'S9'!I$8)","v":" "},{"$f":"IF(ISTEXT('S9'!$J$13),NA(),'S9'!$J$13)","v":{"$error":"#N/A"}},null,{"$f":"IF(ISTEXT('S9'!$J$14),NA(),'S9'!$J$14)","v":{"$error":"#N/A"}},null,{"$f":"IF(ISTEXT('S9'!$J$15),NA(),'S9'!$J$15)","v":{"$error":"#N/A"}},null,{"$f":"IF(ISTEXT('S9'!$J$16),NA(),'S9'!$J$16)","v":{"$error":"#N/A"}},null,{"$f":"IF(ISTEXT('S9'!$J$17),NA(),'S9'!$J$17)","v":{"$error":"#N/A"}}]
[{"$f":"IF(ISBLANK('S9'!K$8),\" \",'S9'!K$8)","v":" "},{"$f":"IF(ISTEXT('S9'!$L$13),NA(),'S9'!$L$13)","v":{"$error":"#N/A"}},null,{"$f":"IF(ISTEXT('S9'!$L$14),NA(),'S9'!$L$14)","v":{"$error":"#N/A"}},null,{"$f":"IF(ISTEXT('S9'!$L$15),NA(),'S9'!$L$15)","v":{"$error":"#N/A"}},null,{"$f":"IF(ISTEXT('S9'!$L$16),NA(),'S9'!$L$16)","v":{"$error":"#N/A"}},null,{"$f":"IF(ISTEXT('S9'!$L$17),NA(),'S9'!$L$17)","v":{"$error":"#N/A"}}]
[{"$f":"IF(ISBLANK('S9'!M$8),\" \",'S9'!M$8)","v":" "},{"$f":"IF(ISTEXT('S9'!$N$13),NA(),'S9'!$N$13)","v":{"$error":"#N/A"}},null,{"$f":"IF(ISTEXT('S9'!$N$14),NA(),'S9'!$N$14)","v":{"$error":"#N/A"}},null,{"$f":"IF(ISTEXT('S9'!$N$15),NA(),'S9'!$N$15)","v":{"$error":"#N/A"}},null,{"$f":"IF(ISTEXT('S9'!$N$16),NA(),'S9'!$N$16)","v":{"$error":"#N/A"}},null,{"$f":"IF(ISTEXT('S9'!$N$17),NA(),'S9'!$N$17)","v":{"$error":"#N/A"}}]
[{"$f":"IF(ISBLANK('S9'!C$24),\" \",'S9'!C$24)","v":" "},{"$f":"IF(ISTEXT('S9'!$D$29),NA(),'S9'!$D$29)","v":{"$error":"#N/A"}},null,{"$f":"IF(ISTEXT('S9'!$D$30),NA(),'S9'!$D$30)","v":{"$error":"#N/A"}},null,{"$f":"IF(ISTEXT('S9'!$D$31),NA(),'S9'!$D$31)","v":{"$error":"#N/A"}},null,{"$f":"IF(ISTEXT('S9'!$D$32),NA(),'S9'!$D$32)","v":{"$error":"#N/A"}},null,{"$f":"IF(ISTEXT('S9'!$D$33),NA(),'S9'!$D$33)","v":{"$error":"#N/A"}}]
[{"$f":"IF(ISBLANK('S9'!E$24),\" \",'S9'!E$24)","v":" "},{"$f":"IF(ISTEXT('S9'!$F$29),NA(),'S9'!$F$29)","v":{"$error":"#N/A"}},null,{"$f":"IF(ISTEXT('S9'!$F$30),NA(),'S9'!$F$30)","v":{"$error":"#N/A"}},null,{"$f":"IF(ISTEXT('S9'!$F$31),NA(),'S9'!$F$31)","v":{"$error":"#N/A"}},null,{"$f":"IF(ISTEXT('S9'!$F$32),NA(),'S9'!$F$32)","v":{"$error":"#N/A"}},null,{"$f":"IF(ISTEXT('S9'!$F$33),NA(),'S9'!$F$33)","v":{"$error":"#N/A"}}]
[{"$f":"IF(ISBLANK('S9'!G$24),\" \",'S9'!G$24)","v":" "},{"$f":"IF(ISTEXT('S9'!$H$29),NA(),'S9'!$H$29)","v":{"$error":"#N/A"}},null,{"$f":"IF(ISTEXT('S9'!$H$30),NA(),'S9'!$H$30)","v":{"$error":"#N/A"}},null,{"$f":"IF(ISTEXT('S9'!$H$31),NA(),'S9'!$H$31)","v":{"$error":"#N/A"}},null,{"$f":"IF(ISTEXT('S9'!$H$32),NA(),'S9'!$H$32)","v":{"$error":"#N/A"}},null,{"$f":"IF(ISTEXT('S9'!$H$33),NA(),'S9'!$H$33)","v":{"$error":"#N/A"}}]
[{"$f":"IF(ISBLANK('S9'!I$24),\" \",'S9'!I$24)","v":" "},{"$f":"IF(ISTEXT('S9'!$J$29),NA(),'S9'!$J$29)","v":{"$error":"#N/A"}},null,{"$f":"IF(ISTEXT('S9'!$J$30),NA(),'S9'!$J$30)","v":{"$error":"#N/A"}},null,{"$f":"IF(ISTEXT('S9'!$J$31),NA(),'S9'!$J$31)","v":{"$error":"#N/A"}},null,{"$f":"IF(ISTEXT('S9'!$J$32),NA(),'S9'!$J$32)","v":{"$error":"#N/A"}},null,{"$f":"IF(ISTEXT('S9'!$J$33),NA(),'S9'!$J$33)","v":{"$error":"#N/A"}}]
[{"$f":"IF(ISBLANK('S9'!K$24),\" \",'S9'!K$24)","v":" "},{"$f":"IF(ISTEXT('S9'!$L$29),NA(),'S9'!$L$29)","v":{"$error":"#N/A"}},null,{"$f":"IF(ISTEXT('S9'!$L$30),NA(),'S9'!$L$30)","v":{"$error":"#N/A"}},null,{"$f":"IF(ISTEXT('S9'!$L$31),NA(),'S9'!$L$31)","v":{"$error":"#N/A"}},null,{"$f":"IF(ISTEXT('S9'!$L$32),NA(),'S9'!$L$32)","v":{"$error":"#N/A"}},null,{"$f":"IF(ISTEXT('S9'!$L$33),NA(),'S9'!$L$33)","v":{"$error":"#N/A"}}]
[{"$f":"IF(ISBLANK('S9'!M$24),\" \",'S9'!M$24)","v":" "},{"$f":"IF(ISTEXT('S9'!$N$29),NA(),'S9'!$N$29)","v":{"$error":"#N/A"}},null,{"$f":"IF(ISTEXT('S9'!$N$30),NA(),'S9'!$N$30)","v":{"$error":"#N/A"}},null,{"$f":"IF(ISTEXT('S9'!$N$31),NA(),'S9'!$N$31)","v":{"$error":"#N/A"}},null,{"$f":"IF(ISTEXT('S9'!$N$32),NA(),'S9'!$N$32)","v":{"$error":"#N/A"}},null,{"$f":"IF(ISTEXT('S9'!$N$33),NA(),'S9'!$N$33)","v":{"$error":"#N/A"}}]
[{"$f":"IF(ISBLANK('S10'!C$8),\" \",'S10'!C$8)","v":" "},{"$f":"IF(ISTEXT('S10'!$D$13),NA(),'S10'!$D$13)","v":{"$error":"#N/A"}},null,{"$f":"IF(ISTEXT('S10'!$D$14),NA(),'S10'!$D$14)","v":{"$error":"#N/A"}},null,{"$f":"IF(ISTEXT('S10'!$D$15),NA(),'S10'!$D$15)","v":{"$error":"#N/A"}},null,{"$f":"IF(ISTEXT('S10'!$D$16),NA(),'S10'!$D$16)","v":{"$error":"#N/A"}},null,{"$f":"IF(ISTEXT('S10'!$D$17),NA(),'S10'!$D$17)","v":{"$error":"#N/A"}}]
[{"$f":"IF(ISBLANK('S10'!E$8),\" \",'S10'!E$8)","v":" "},{"$f":"IF(ISTEXT('S10'!$F$13),NA(),'S10'!$F$13)","v":{"$error":"#N/A"}},null,{"$f":"IF(ISTEXT('S10'!$F$14),NA(),'S10'!$F$14)","v":{"$error":"#N/A"}},null,{"$f":"IF(ISTEXT('S10'!$F$15),NA(),'S10'!$F$15)","v":{"$error":"#N/A"}},null,{"$f":"IF(ISTEXT('S10'!$F$16),NA(),'S10'!$F$16)","v":{"$error":"#N/A"}},null,{"$f":"IF(ISTEXT('S10'!$F$17),NA(),'S10'!$F$17)","v":{"$error":"#N/A"}}]
[{"$f":"IF(ISBLANK('S10'!G$8),\" \",'S10'!G$8)","v":" "},{"$f":"IF(ISTEXT('S10'!$H$13),NA(),'S10'!$H$13)","v":{"$error":"#N/A"}},null,{"$f":"IF(ISTEXT('S10'!$H$14),NA(),'S10'!$H$14)","v":{"$error":"#N/A"}},null,{"$f":"IF(ISTEXT('S10'!$H$15),NA(),'S10'!$H$15)","v":{"$error":"#N/A"}},null,{"$f":"IF(ISTEXT('S10'!$H$16),NA(),'S10'!$H$16)","v":{"$error":"#N/A"}},null,{"$f":"IF(ISTEXT('S10'!$H$17),NA(),'S10'!$H$17)","v":{"$error":"#N/A"}}]
[{"$f":"IF(ISBLANK('S10'!I$8),\" \",'S10'!I$8)","v":" "},{"$f":"IF(ISTEXT('S10'!$J$13),NA(),'S10'!$J$13)","v":{"$error":"#N/A"}},null,{"$f":"IF(ISTEXT('S10'!$J$14),NA(),'S10'!$J$14)","v":{"$error":"#N/A"}},null,{"$f":"IF(ISTEXT('S10'!$J$15),NA(),'S10'!$J$15)","v":{"$error":"#N/A"}},null,{"$f":"IF(ISTEXT('S10'!$J$16),NA(),'S10'!$J$16)","v":{"$error":"#N/A"}},null,{"$f":"IF(ISTEXT('S10'!$J$17),NA(),'S10'!$J$17)","v":{"$error":"#N/A"}}]
[{"$f":"IF(ISBLANK('S10'!K$8),\" \",'S10'!K$8)","v":" "},{"$f":"IF(ISTEXT('S10'!$L$13),NA(),'S10'!$L$13)","v":{"$error":"#N/A"}},null,{"$f":"IF(ISTEXT('S10'!$L$14),NA(),'S10'!$L$14)","v":{"$error":"#N/A"}},null,{"$f":"IF(ISTEXT('S10'!$L$15),NA(),'S10'!$L$15)","v":{"$error":"#N/A"}},null,{"$f":"IF(ISTEXT('S10'!$L$16),NA(),'S10'!$L$16)","v":{"$error":"#N/A"}},null,{"$f":"IF(ISTEXT('S10'!$L$17),NA(),'S10'!$L$17)","v":{"$error":"#N/A"}}]
[{"$f":"IF(ISBLANK('S10'!M$8),\" \",'S10'!M$8)","v":" "},{"$f":"IF(ISTEXT('S10'!$N$13),NA(),'S10'!$N$13)","v":{"$error":"#N/A"}},null,{"$f":"IF(ISTEXT('S10'!$N$14),NA(),'S10'!$N$14)","v":{"$error":"#N/A"}},null,{"$f":"IF(ISTEXT('S10'!$N$15),NA(),'S10'!$N$15)","v":{"$error":"#N/A"}},null,{"$f":"IF(ISTEXT('S10'!$N$16),NA(),'S10'!$N$16)","v":{"$error":"#N/A"}},null,{"$f":"IF(ISTEXT('S10'!$N$17),NA(),'S10'!$N$17)","v":{"$error":"#N/A"}}]
[{"$f":"IF(ISBLANK('S10'!C$24),\" \",'S10'!C$24)","v":" "},{"$f":"IF(ISTEXT('S10'!$D$29),NA(),'S10'!$D$29)","v":{"$error":"#N/A"}},null,{"$f":"IF(ISTEXT('S10'!$D$30),NA(),'S10'!$D$30)","v":{"$error":"#N/A"}},null,{"$f":"IF(ISTEXT('S10'!$D$31),NA(),'S10'!$D$31)","v":{"$error":"#N/A"}},null,{"$f":"IF(ISTEXT('S10'!$D$32),NA(),'S10'!$D$32)","v":{"$error":"#N/A"}},null,{"$f":"IF(ISTEXT('S10'!$D$33),NA(),'S10'!$D$33)","v":{"$error":"#N/A"}}]
[{"$f":"IF(ISBLANK('S10'!E$24),\" \",'S10'!E$24)","v":" "},{"$f":"IF(ISTEXT('S10'!$F$29),NA(),'S10'!$F$29)","v":{"$error":"#N/A"}},null,{"$f":"IF(ISTEXT('S10'!$F$30),NA(),'S10'!$F$30)","v":{"$error":"#N/A"}},null,{"$f":"IF(ISTEXT('S10'!$F$31),NA(),'S10'!$F$31)","v":{"$error":"#N/A"}},null,{"$f":"IF(ISTEXT('S10'!$F$32),NA(),'S10'!$F$32)","v":{"$error":"#N/A"}},null,{"$f":"IF(ISTEXT('S10'!$F$33),NA(),'S10'!$F$33)","v":{"$error":"#N/A"}}]
[{"$f":"IF(ISBLANK('S10'!G$24),\" \",'S10'!G$24)","v":" "},{"$f":"IF(ISTEXT('S10'!$H$29),NA(),'S10'!$H$29)","v":{"$error":"#N/A"}},null,{"$f":"IF(ISTEXT('S10'!$H$30),NA(),'S10'!$H$30)","v":{"$error":"#N/A"}},null,{"$f":"IF(ISTEXT('S10'!$H$31),NA(),'S10'!$H$31)","v":{"$error":"#N/A"}},null,{"$f":"IF(ISTEXT('S10'!$H$32),NA(),'S10'!$H$32)","v":{"$error":"#N/A"}},null,{"$f":"IF(ISTEXT('S10'!$H$33),NA(),'S10'!$H$33)","v":{"$error":"#N/A"}}]
[{"$f":"IF(ISBLANK('S10'!I$24),\" \",'S10'!I$24)","v":" "},{"$f":"IF(ISTEXT('S10'!$J$29),NA(),'S10'!$J$29)","v":{"$error":"#N/A"}},null,{"$f":"IF(ISTEXT('S10'!$J$30),NA(),'S10'!$J$30)","v":{"$error":"#N/A"}},null,{"$f":"IF(ISTEXT('S10'!$J$31),NA(),'S10'!$J$31)","v":{"$error":"#N/A"}},null,{"$f":"IF(ISTEXT('S10'!$J$32),NA(),'S10'!$J$32)","v":{"$error":"#N/A"}},null,{"$f":"IF(ISTEXT('S10'!$J$33),NA(),'S10'!$J$33)","v":{"$error":"#N/A"}}]
[{"$f":"IF(ISBLANK('S10'!K$24),\" \",'S10'!K$24)","v":" "},{"$f":"IF(ISTEXT('S10'!$L$29),NA(),'S10'!$L$29)","v":{"$error":"#N/A"}},null,{"$f":"IF(ISTEXT('S10'!$L$30),NA(),'S10'!$L$30)","v":{"$error":"#N/A"}},null,{"$f":"IF(ISTEXT('S10'!$L$31),NA(),'S10'!$L$31)","v":{"$error":"#N/A"}},null,{"$f":"IF(ISTEXT('S10'!$L$32),NA(),'S10'!$L$32)","v":{"$error":"#N/A"}},null,{"$f":"IF(ISTEXT('S10'!$L$33),NA(),'S10'!$L$33)","v":{"$error":"#N/A"}}]
[{"$f":"IF(ISBLANK('S10'!M$24),\" \",'S10'!M$24)","v":" "},{"$f":"IF(ISTEXT('S10'!$N$29),NA(),'S10'!$N$29)","v":{"$error":"#N/A"}},null,{"$f":"IF(ISTEXT('S10'!$N$30),NA(),'S10'!$N$30)","v":{"$error":"#N/A"}},null,{"$f":"IF(ISTEXT('S10'!$N$31),NA(),'S10'!$N$31)","v":{"$error":"#N/A"}},null,{"$f":"IF(ISTEXT('S10'!$N$32),NA(),'S10'!$N$32)","v":{"$error":"#N/A"}},null,{"$f":"IF(ISTEXT('S10'!$N$33),NA(),'S10'!$N$33)","v":{"$error":"#N/A"}}]

{"sheet":"AP","index":18,"n_rows":20,"n_cols":14,"rows_kept":20,"cut":false,"hidden":true,"merged":[[16,0,18,0],[0,1,0,3],[4,0,6,0],[8,0,10,0],[12,0,14,0]]}
[null,null,null,null,null,null,null,{"$f":"'S1'!L4","v":"Type 2"}]
[]
[]
[]
[0.5,"Max",105]
[]
[null,"Min",95]
[]
[0.375,"Max",100]
[]
[null,"Min",{"$f":"IF($H$1=3,90,95)","v":95}]
[]
[8,"Max",{"$f":"IF($H$1=\"Type 2\",30,IF(H1=\"Type 4\",30,IF(H1=\"Type 3\",85,IF(H1=\"Type 3A\",55))))","v":30}]
[null,null,null,"Major unit",{"$f":"IF(H1=\"Type 3\",10,5)","v":5}]
[null,"Min",0]
[]
[100,"Max",10]
[]
[null,"Min",0]
[null,null,null,null,null,null,null,null,null,null,null,null,null,"`"]