{"text_format":"1","workbook":"xlsx","n_sheets":19,"sheets":["S1","S2","S3","S4","S5","S6","S7","S8","S9","S10","Chart 1-24","Chart 25-48","Chart 49-72","Chart 73-96","Chart 97-120","ST1","Avg","ST13","AP"],"not_rendered":{"charts":25,"images":28,"macros":1,"external_links":0,"defined_names":2,"comments":0,"pivot_tables":0},"unopened":[],"bounds":{"document_bytes":16777216,"sheet_cells":100000,"rows_first":2000,"rows_last":500,"rows_between":2000,"halvings":0,"cell_chars":16384,"cell_head_chars":4096},"cells_cut":0,"cells_raw":0,"read":"whole","date_system":"1900"}

{"sheet":"S1","index":0,"n_rows":46,"n_cols":19,"rows_kept":46,"cut":false,"hidden":false,"merged":[[8,12,8,13],[25,10,25,11],[25,12,25,13],[19,8,19,9],[19,10,19,11],[19,12,19,13],[20,8,23,9],[20,12,23,13],[25,8,25,9],[11,12,11,13],[20,10,23,11],[11,8,11,9],[11,10,11,11],[38,0,41,1],[38,2,41,3],[38,4,41,5],[38,6,41,7],[8,10,8,11],[37,6,37,7],[29,6,29,7],[38,8,41,9],[38,10,41,11],[37,4,37,5],[25,0,25,1],[25,2,25,3],[25,4,25,5],[25,6,25,7],[27,0,27,1],[26,0,26,1],[38,12,41,13],[26,10,26,11],[28,0,28,1],[26,12,26,13],[37,10,37,11],[37,12,37,13],[29,8,29,9],[29,10,29,11],[29,12,29,13],[26,8,26,9],[29,0,29,1],[29,2,29,3],[29,4,29,5],[37,8,37,9],[37,0,37,1],[37,2,37,3],[26,2,26,3],[26,4,26,5],[26,6,26,7],[20,0,23,1],[20,2,23,3],[20,4,23,5],[20,6,23,7],[11,0,11,1],[11,2,11,3],[11,4,11,5],[11,6,11,7],[19,0,19,1],[19,2,19,3],[19,4,19,5],[19,6,19,7],[9,0,9,1],[10,0,10,1],[8,8,8,9],[8,0,8,1],[8,2,8,3],[8,4,8,5],[8,6,8,7],[1,11,1,12],[2,11,2,12],[3,11,3,12],[7,6,7,7],[7,10,7,11],[7,12,7,13],[7,8,7,9],[1,9,1,10],[1,2,1,6],[2,2,2,6],[3,2,3,6],[7,0,7,1],[7,2,7,3],[2,9,2,10],[3,9,3,10],[5,3,5,8],[7,4,7,5],[0,0,3,1],[4,0,4,1],[0,7,3,8]]}
[]
[null,null,"COMMONWEALTH OF PENNSYLVANIA",null,null,null,null,null,null,"DISTRICT"]
[null,null,"DEPARTMENT OF TRANSPORTATION",null,null,null,null,null,null,"PLANT CODE",null,null,null,null,null,null,null,null,"Type 3B"]
[null,null,"PENNSYLVANIA TURNPIKE COMMISSION",null,null,null,null,null,null,"AGG SIZE",null,"Type 3B",null,null,null,null,null,null,"Type 6S"]
["Aggregate 2023",null,null,null,null,null,null,null,null,null,null,null,null,null,null,null,null,null,"AS1"]
[null,null,null,"Material Test Results for Type 3B Anti-Skid",null,null,null,null,null,null,null,null,null,null,null,null,null,null,"AS2"]
[]
["Sample No."]
["Date"]
["St. Wt. Before Wash.",null,null,"% Loss",null,"% Loss",null,"% Loss",null,"% Loss",null,"% Loss",null,"% Loss"]
["Dry. Wt. After Wash.",null,null,{"$f":"IF(ISBLANK(C10),\" \",IF(ISBLANK(C14),\" \",(C11-C14)/C11*100))","v":" "},null,{"$f":"IF(ISBLANK(E10),\" \",IF(ISBLANK(E14),\" \",(E11-E14)/E11*100))","v":" "},null,{"$f":"IF(ISBLANK(G10),\" \",IF(ISBLANK(G14),\" \",(G11-G14)/G11*100))","v":" "},null,{"$f":"IF(ISBLANK(I10),\" \",IF(ISBLANK(I14),\" \",(I11-I14)/I11*100))","v":" "},null,{"$f":"IF(ISBLANK(K10),\" \",IF(ISBLANK(K14),\" \",(K11-K14)/K11*100))","v":" "},null,{"$f":"IF(ISBLANK(M10),\" \",IF(ISBLANK(M14),\" \",(M11-M14)/M11*100))","v":" "},null,null,null,null,"0-3"]
["Wt. Loss",null,{"$f":"IF(ISBLANK(C10),\" \",IF(ISBLANK(C11),\" \",C10-C11))","v":" "},null,{"$f":"IF(ISBLANK(E10),\" \",IF(ISBLANK(E11),\" \",E10-E11))","v":" "},null,{"$f":"IF(ISBLANK(G10),\" \",IF(ISBLANK(G11),\" \",G10-G11))","v":" "},null,{"$f":"IF(ISBLANK(I10),\" \",IF(ISBLANK(I11),\" \",I10-I11))","v":" "},null,{"$f":"IF(ISBLANK(K10),\" \",IF(ISBLANK(K11),\" \",K10-K11))","v":" "},null,{"$f":"IF(ISBLANK(M10),\" \",IF(ISBLANK(M11),\" \",M10-M11))","v":" "},null,null,null,null,null,"0-4"]
["Spec","Sieve","Wt","% Passing","Wt","% Passing","Wt","% Passing","Wt","% Passing","Wt","% Passing","Wt","% Passing",null,null,null,null,"0-5"]
["100",0.375,null,{"$f":"IF(ISBLANK(C$10),\"  \",IF(ISBLANK(C$11),\" \",IF(ISBLANK(C14),\" \",ROUND((C14+C$12)/C$10*100,1))))","v":"  "},null,{"$f":"IF(ISBLANK(E$10),\"  \",IF(ISBLANK(E$11),\" \",IF(ISBLANK(E14),\" \",ROUND((E14+E$12)/E$10*100,1))))","v":"  "},null,{"$f":"IF(ISBLANK(G$10),\"  \",IF(ISBLANK(G$11),\" \",IF(ISBLANK(G14),\" \",ROUND((G14+G$12)/G$10*100,1))))","v":"  "},null,{"$f":"IF(ISBLANK(I$10),\"  \",IF(ISBLANK(I$11),\" \",IF(ISBLANK(I14),\" \",ROUND((I14+I$12)/I$10*100,1))))","v":"  "},null,{"$f":"IF(ISBLANK(K$10),\"  \",IF(ISBLANK(K$11),\" \",IF(ISBLANK(K14),\" \",ROUND((K14+K$12)/K$10*100,1))))","v":"  "},null,{"$f":"IF(ISBLANK(M$10),\"  \",IF(ISBLANK(M$11),\" \",IF(ISBLANK(M14),\" \",ROUND((M14+M$12)/M$10*100,1))))","v":"  "}]
["Breaker",0.25,null,{"$f":"IF(ISBLANK(C$10),\"  \",IF(ISBLANK(C$11),\" \",IF(ISBLANK(C15),\" \",ROUND((C15+C$12)/C$10*100,0))))","v":"  "},null,{"$f":"IF(ISBLANK(E$10),\"  \",IF(ISBLANK(E$11),\" \",IF(ISBLANK(E15),\" \",ROUND((E15+E$12)/E$10*100,0))))","v":"  "},null,{"$f":"IF(ISBLANK(G$10),\"  \",IF(ISBLANK(G$11),\" \",IF(ISBLANK(G15),\" \",ROUND((G15+G$12)/G$10*100,0))))","v":"  "},null,{"$f":"IF(ISBLANK(I$10),\"  \",IF(ISBLANK(I$11),\" \",IF(ISBLANK(I15),\" \",ROUND((I15+I$12)/I$10*100,0))))","v":"  "},null,{"$f":"IF(ISBLANK(K$10),\"  \",IF(ISBLANK(K$11),\" \",IF(ISBLANK(K15),\" \",ROUND((K15+K$12)/K$10*100,0))))","v":"  "},null,{"$f":"IF(ISBLANK(M$10),\"  \",IF(ISBLANK(M$11),\" \",IF(ISBLANK(M15),\" \",ROUND((M15+M$12)/M$10*100,0))))","v":"  "}]
["85-100",4,null,{"$f":"IF(ISBLANK(C$10),\"  \",IF(ISBLANK(C$11),\" \",IF(ISBLANK(C16),\" \",ROUND((C16+C$12)/C$10*100,0))))","v":"  "},null,{"$f":"IF(ISBLANK(E$10),\"  \",IF(ISBLANK(E$11),\" \",IF(ISBLANK(E16),\" \",ROUND((E16+E$12)/E$10*100,0))))","v":"  "},null,{"$f":"IF(ISBLANK(G$10),\"  \",IF(ISBLANK(G$11),\" \",IF(ISBLANK(G16),\" \",ROUND((G16+G$12)/G$10*100,0))))","v":"  "},null,{"$f":"IF(ISBLANK(I$10),\"  \",IF(ISBLANK(I$11),\" \",IF(ISBLANK(I16),\" \",ROUND((I16+I$12)/I$10*100,0))))","v":"  "},null,{"$f":"IF(ISBLANK(K$10),\"  \",IF(ISBLANK(K$11),\" \",IF(ISBLANK(K16),\" \",ROUND((K16+K$12)/K$10*100,0))))","v":"  "},null,{"$f":"IF(ISBLANK(M$10),\"  \",IF(ISBLANK(M$11),\" \",IF(ISBLANK(M16),\" \",ROUND((M16+M$12)/M$10*100,0))))","v":"  "}]
["0-55",8,null,{"$f":"IF(ISBLANK(C$10),\"  \",IF(ISBLANK(C$11),\" \",IF(ISBLANK(C17),\" \",ROUND((C17+C$12)/C$10*100,0))))","v":"  "},null,{"$f":"IF(ISBLANK(E$10),\"  \",IF(ISBLANK(E$11),\" \",IF(ISBLANK(E17),\" \",ROUND((E17+E$12)/E$10*100,0))))","v":"  "},null,{"$f":"IF(ISBLANK(G$10),\"  \",IF(ISBLANK(G$11),\" \",IF(ISBLANK(G17),\" \",ROUND((G17+G$12)/G$10*100,0))))","v":"  "},null,{"$f":"IF(ISBLANK(I$10),\"  \",IF(ISBLANK(I$11),\" \",IF(ISBLANK(I17),\" \",ROUND((I17+I$12)/I$10*100,0))))","v":"  "},null,{"$f":"IF(ISBLANK(K$10),\"  \",IF(ISBLANK(K$11),\" \",IF(ISBLANK(K17),\" \",ROUND((K17+K$12)/K$10*100,0))))","v":"  "},null,{"$f":"IF(ISBLANK(M$10),\"  \",IF(ISBLANK(M$11),\" \",IF(ISBLANK(M17),\" \",ROUND((M17+M$12)/M$10*100,0))))","v":"  "}]
["0-5",100,null,{"$f":"IF(ISBLANK(C$10),\"  \",IF(ISBLANK(C$11),\" \",IF(ISBLANK(C18),\" \",ROUND((C18+C$12)/C$10*100,0))))","v":"  "},null,{"$f":"IF(ISBLANK(E$10),\"  \",IF(ISBLANK(E$11),\" \",IF(ISBLANK(E18),\" \",ROUND((E18+E$12)/E$10*100,0))))","v":"  "},null,{"$f":"IF(ISBLANK(G$10),\"  \",IF(ISBLANK(G$11),\" \",IF(ISBLANK(G18),\" \",ROUND((G18+G$12)/G$10*100,0))))","v":"  "},null,{"$f":"IF(ISBLANK(I$10),\"  \",IF(ISBLANK(I$11),\" \",IF(ISBLANK(I18),\" \",ROUND((I18+I$12)/I$10*100,0))))","v":"  "},null,{"$f":"IF(ISBLANK(K$10),\"  \",IF(ISBLANK(K$11),\" \",IF(ISBLANK(K18),\" \",ROUND((K18+K$12)/K$10*100,0))))","v":"  "},null,{"$f":"IF(ISBLANK(M$10),\"  \",IF(ISBLANK(M$11),\" \",IF(ISBLANK(M18),\" \",ROUND((M18+M$12)/M$10*100,0))))","v":"  "}]
["0-4",200,null,{"$f":"IF(ISBLANK(C$10),\"  \",IF(ISBLANK(C$11),\" \",IF(ISBLANK(C19),\" \",ROUND((C19+C$12)/C$10*100,2))))","v":"  "},null,{"$f":"IF(ISBLANK(E$10),\"  \",IF(ISBLANK(E$11),\" \",IF(ISBLANK(E19),\" \",ROUND((E19+E$12)/E$10*100,2))))","v":"  "},null,{"$f":"IF(ISBLANK(G$10),\"  \",IF(ISBLANK(G$11),\" \",IF(ISBLANK(G19),\" \",ROUND((G19+G$12)/G$10*100,2))))","v":"  "},null,{"$f":"IF(ISBLANK(I$10),\"  \",IF(ISBLANK(I$11),\" \",IF(ISBLANK(I19),\" \",ROUND((I19+I$12)/I$10*100,2))))","v":"  "},null,{"$f":"IF(ISBLANK(K$10),\"  \",IF(ISBLANK(K$11),\" \",IF(ISBLANK(K19),\" \",ROUND((K19+K$12)/K$10*100,2))))","v":"  "},null,{"$f":"IF(ISBLANK(M$10),\"  \",IF(ISBLANK(M$11),\" \",IF(ISBLANK(M19),\" \",ROUND((M19+M$12)/M$10*100,2))))","v":"  "}]
["Tested By"]
["Remarks"]
[]
[]
[]
[]
["Sample No."]
["Date"]
[{"$f":"A10","v":"St. Wt. Before Wash."},null,null,"% Loss",null,"% Loss",null,"% Loss",null,"% Loss",null,"% Loss",null,"% Loss"]
[{"$f":"A11","v":"Dry. Wt. After Wash."},null,null,{"$f":"IF(ISBLANK(C28),\" \",IF(ISBLANK(C32),\" \",(C29-C32)/C29*100))","v":" "},null,{"$f":"IF(ISBLANK(E28),\" \",IF(ISBLANK(E32),\" \",(E29-E32)/E29*100))","v":" "},null,{"$f":"IF(ISBLANK(G28),\" \",IF(ISBLANK(G32),\" \",(G29-G32)/G29*100))","v":" "},null,{"$f":"IF(ISBLANK(I28),\" \",IF(ISBLANK(I32),\" \",(I29-I32)/I29*100))","v":" "},null,{"$f":"IF(ISBLANK(K28),\" \",IF(ISBLANK(K32),\" \",(K29-K32)/K29*100))","v":" "},null,{"$f":"IF(ISBLANK(M28),\" \",IF(ISBLANK(M32),\" \",(M29-M32)/M29*100))","v":" "}]
["Wt. Loss",null,{"$f":"IF(ISBLANK(C28),\" \",IF(ISBLANK(C29),\" \",C28-C29))","v":" "},null,{"$f":"IF(ISBLANK(E28),\" \",IF(ISBLANK(E29),\" \",E28-E29))","v":" "},null,{"$f":"IF(ISBLANK(G28),\" \",IF(ISBLANK(G29),\" \",G28-G29))","v":" "},null,{"$f":"IF(ISBLANK(I28),\" \",IF(ISBLANK(I29),\" \",I28-I29))","v":" "},null,{"$f":"IF(ISBLANK(K28),\" \",IF(ISBLANK(K29),\" \",K28-K29))","v":" "},null,{"$f":"IF(ISBLANK(M28),\" \",IF(ISBLANK(M29),\" \",M28-M29))","v":" "}]
["Spec","Sieve","Wt","% Passing","Wt","% Passing","Wt","% Passing","Wt","% Passing","Wt","% Passing","Wt","% Passing"]
[100,0.375,null,{"$f":"IF(ISBLANK(C$28),\"  \",IF(ISBLANK(C$29),\" \",IF(ISBLANK(C32),\" \",ROUND((C32+C$30)/C$28*100,1))))","v":"  "},null,{"$f":"IF(ISBLANK(E$28),\"  \",IF(ISBLANK(E$29),\" \",IF(ISBLANK(E32),\" \",ROUND((E32+E$30)/E$28*100,1))))","v":"  "},null,{"$f":"IF(ISBLANK(G$28),\"  \",IF(ISBLANK(G$29),\" \",IF(ISBLANK(G32),\" \",ROUND((G32+G$30)/G$28*100,1))))","v":"  "},null,{"$f":"IF(ISBLANK(I$28),\"  \",IF(ISBLANK(I$29),\" \",IF(ISBLANK(I32),\" \",ROUND((I32+I$30)/I$28*100,1))))","v":"  "},null,{"$f":"IF(ISBLANK(K$28),\"  \",IF(ISBLANK(K$29),\" \",IF(ISBLANK(K32),\" \",ROUND((K32+K$30)/K$28*100,1))))","v":"  "},null,{"$f":"IF(ISBLANK(M$28),\"  \",IF(ISBLANK(M$29),\" \",IF(ISBLANK(M32),\" \",ROUND((M32+M$30)/M$28*100,1))))","v":"  "}]
["Breaker",0.25,null,{"$f":"IF(ISBLANK(C$28),\"  \",IF(ISBLANK(C$29),\" \",IF(ISBLANK(C33),\" \",ROUND((C33+C$30)/C$28*100,0))))","v":"  "},null,{"$f":"IF(ISBLANK(E$28),\"  \",IF(ISBLANK(E$29),\" \",IF(ISBLANK(E33),\" \",ROUND((E33+E$30)/E$28*100,0))))","v":"  "},null,{"$f":"IF(ISBLANK(G$28),\"  \",IF(ISBLANK(G$29),\" \",IF(ISBLANK(G33),\" \",ROUND((G33+G$30)/G$28*100,0))))","v":"  "},null,{"$f":"IF(ISBLANK(I$28),\"  \",IF(ISBLANK(I$29),\" \",IF(ISBLANK(I33),\" \",ROUND((I33+I$30)/I$28*100,0))))","v":"  "},null,{"$f":"IF(ISBLANK(K$28),\"  \",IF(ISBLANK(K$29),\" \",IF(ISBLANK(K33),\" \",ROUND((K33+K$30)/K$28*100,0))))","v":"  "},null,{"$f":"IF(ISBLANK(M$28),\"  \",IF(ISBLANK(M$29),\" \",IF(ISBLANK(M33),\" \",ROUND((M33+M$30)/M$28*100,0))))","v":"  "}]
[{"$f":"A16","v":"85-100"},4,null,{"$f":"IF(ISBLANK(C$28),\"  \",IF(ISBLANK(C$29),\" \",IF(ISBLANK(C34),\" \",ROUND((C34+C$30)/C$28*100,0))))","v":"  "},null,{"$f":"IF(ISBLANK(E$28),\"  \",IF(ISBLANK(E$29),\" \",IF(ISBLANK(E34),\" \",ROUND((E34+E$30)/E$28*100,0))))","v":"  "},null,{"$f":"IF(ISBLANK(G$28),\"  \",IF(ISBLANK(G$29),\" \",IF(ISBLANK(G34),\" \",ROUND((G34+G$30)/G$28*100,0))))","v":"  "},null,{"$f":"IF(ISBLANK(I$28),\"  \",IF(ISBLANK(I$29),\" \",IF(ISBLANK(I34),\" \",ROUND((I34+I$30)/I$28*100,0))))","v":"  "},null,{"$f":"IF(ISBLANK(K$28),\"  \",IF(ISBLANK(K$29),\" \",IF(ISBLANK(K34),\" \",ROUND((K34+K$30)/K$28*100,0))))","v":"  "},null,{"$f":"IF(ISBLANK(M$28),\"  \",IF(ISBLANK(M$29),\" \",IF(ISBLANK(M34),\" \",ROUND((M34+M$30)/M$28*100,0))))","v":"  "}]
[{"$f":"A17","v":"0-55"},8,null,{"$f":"IF(ISBLANK(C$28),\"  \",IF(ISBLANK(C$29),\" \",IF(ISBLANK(C35),\" \",ROUND((C35+C$30)/C$28*100,0))))","v":"  "},null,{"$f":"IF(ISBLANK(E$28),\"  \",IF(ISBLANK(E$29),\" \",IF(ISBLANK(E35),\" \",ROUND((E35+E$30)/E$28*100,0))))","v":"  "},null,{"$f":"IF(ISBLANK(G$28),\"  \",IF(ISBLANK(G$29),\" \",IF(ISBLANK(G35),\" \",ROUND((G35+G$30)/G$28*100,0))))","v":"  "},null,{"$f":"IF(ISBLANK(I$28),\"  \",IF(ISBLANK(I$29),\" \",IF(ISBLANK(I35),\" \",ROUND((I35+I$30)/I$28*100,0))))","v":"  "},null,{"$f":"IF(ISBLANK(K$28),\"  \",IF(ISBLANK(K$29),\" \",IF(ISBLANK(K35),\" \",ROUND((K35+K$30)/K$28*100,0))))","v":"  "},null,{"$f":"IF(ISBLANK(M$28),\"  \",IF(ISBLANK(M$29),\" \",IF(ISBLANK(M35),\" \",ROUND((M35+M$30)/M$28*100,0))))","v":"  "}]
[{"$f":"A18","v":"0-5"},100,null,{"$f":"IF(ISBLANK(C$28),\"  \",IF(ISBLANK(C$29),\" \",IF(ISBLANK(C36),\" \",ROUND((C36+C$30)/C$28*100,0))))","v":"  "},null,{"$f":"IF(ISBLANK(E$28),\"  \",IF(ISBLANK(E$29),\" \",IF(ISBLANK(E36),\" \",ROUND((E36+E$30)/E$28*100,0))))","v":"  "},null,{"$f":"IF(ISBLANK(G$28),\"  \",IF(ISBLANK(G$29),\" \",IF(ISBLANK(G36),\" \",ROUND((G36+G$30)/G$28*100,0))))","v":"  "},null,{"$f":"IF(ISBLANK(I$28),\"  \",IF(ISBLANK(I$29),\" \",IF(ISBLANK(I36),\" \",ROUND((I36+I$30)/I$28*100,0))))","v":"  "},null,{"$f":"IF(ISBLANK(K$28),\"  \",IF(ISBLANK(K$29),\" \",IF(ISBLANK(K36),\" \",ROUND((K36+K$30)/K$28*100,0))))","v":"  "},null,{"$f":"IF(ISBLANK(M$28),\"  \",IF(ISBLANK(M$29),\" \",IF(ISBLANK(M36),\" \",ROUND((M36+M$30)/M$28*100,0))))","v":"  "}]
[{"$f":"A19","v":"0-4"},200,null,{"$f":"IF(ISBLANK(C$28),\"  \",IF(ISBLANK(C$29),\" \",IF(ISBLANK(C37),\" \",ROUND((C37+C$30)/C$28*100,2))))","v":"  "},null,{"$f":"IF(ISBLANK(E$28),\"  \",IF(ISBLANK(E$29),\" \",IF(ISBLANK(E37),\" \",ROUND((E37+E$30)/E$28*100,2))))","v":"  "},null,{"$f":"IF(ISBLANK(G$28),\"  \",IF(ISBLANK(G$29),\" \",IF(ISBLANK(G37),\" \",ROUND((G37+G$30)/G$28*100,2))))","v":"  "},null,{"$f":"IF(ISBLANK(I$28),\"  \",IF(ISBLANK(I$29),\" \",IF(ISBLANK(I37),\" \",ROUND((I37+I$30)/I$28*100,2))))","v":"  "},null,{"$f":"IF(ISBLANK(K$28),\"  \",IF(ISBLANK(K$29),\" \",IF(ISBLANK(K37),\" \",ROUND((K37+K$30)/K$28*100,2))))","v":"  "},null,{"$f":"IF(ISBLANK(M$28),\"  \",IF(ISBLANK(M$29),\" \",IF(ISBLANK(M37),\" \",ROUND((M37+M$30)/M$28*100,2))))","v":"  "}]
["Tested By"]
["Remarks"]
[]
[]
[]
[]
[null,"B action","T action"]
[{"$f":"M6","v":0},{"$f":"A45-0.2","v":-0.2},{"$f":"A45+0.2","v":0.2}]
[null,{"$f":"A45-0.4","v":-0.4},{"$f":"A45+0.4","v":0.4}]

{"sheet":"S2","index":1,"n_rows":39,"n_cols":14,"rows_kept":39,"cut":false,"hidden":true,"merged":[[11,6,11,7],[27,0,27,1],[28,0,28,1],[29,0,29,1],[29,2,29,3],[29,4,29,5],[29,6,29,7],[25,0,25,1],[26,0,26,1],[19,6,19,7],[25,2,25,3],[25,4,25,5],[25,6,25,7],[26,4,26,5],[26,2,26,3],[37,0,37,1],[37,2,37,3],[37,4,37,5],[37,6,37,7],[38,10,41,11],[37,10,37,11],[38,12,41,13],[38,0,41,1],[38,2,41,3],[38,4,41,5],[38,6,41,7],[38,8,41,9],[37,12,37,13],[29,12,29,13],[29,8,29,9],[29,10,29,11],[37,8,37,9],[11,8,11,9],[1,10,1,11],[1,12,1,13],[2,10,2,11],[2,12,2,13],[3,10,3,11],[3,12,3,13],[7,10,7,11],[7,12,7,13],[11,12,11,13],[8,10,8,11],[8,12,8,13],[11,10,11,11],[0,8,3,9],[1,2,1,7],[5,3,5,8],[7,0,7,1],[7,2,7,3],[7,4,7,5],[7,6,7,7],[7,8,7,9],[2,2,2,7],[3,2,3,7],[4,0,4,1],[0,0,3,1],[8,4,8,5],[8,6,8,7],[8,8,8,9],[9,0,9,1],[8,0,8,1],[8,2,8,3],[10,0,10,1],[19,2,19,3],[19,4,19,5],[19,0,19,1],[20,0,23,1],[20,2,23,3],[20,4,23,5],[11,0,11,1],[11,2,11,3],[11,4,11,5],[26,12,26,13],[26,10,26,11],[19,12,19,13],[26,6,26,7],[25,12,25,13],[19,10,19,11],[19,8,19,9],[20,6,23,7],[20,8,23,9],[25,10,25,11],[20,10,23,11],[20,12,23,13],[26,8,26,9],[25,8,25,9]]}
[]
[null,null,"COMMONWEALTH OF PENNSYLVANIA",null,null,null,null,null,null,null,"DISTRICT",null,{"$f":"IF(ISBLANK('S1'!L2),\"\",'S1'!L2)","v":""}]
[null,null,"DEPARTMENT OF TRANSPORTATION",null,null,null,null,null,null,null,"PLANT CODE",null,{"$f":"IF(ISBLANK('S1'!L3),\"\",'S1'!L3)","v":""}]
[null,null,"PENNSYLVANIA TURNPIKE COMMISSION",null,null,null,null,null,null,null,"AGG SIZE",null,{"$f":"IF(ISBLANK('S1'!L4),\"\",'S1'!L4)","v":"Type 3B"}]
[{"$f":"'S1'!A5","v":"Aggregate 2023"}]
[null,null,null,{"$f":"'S1'!D6","v":"Material Test Results for Type 3B Anti-Skid"}]
[]
["Sample No."]
["Date"]
["St Wt Before Wash",null,null,"% Loss",null,"% Loss",null,"% Loss",null,"% Loss",null,"% Loss",null,"% Loss"]
["Dry Wt After Wash",null,null,{"$f":"IF(ISBLANK(C10),\" \",IF(ISBLANK(C14),\" \",(C11-C14)/C11*100))","v":" "},null,{"$f":"IF(ISBLANK(E10),\" \",IF(ISBLANK(E14),\" \",(E11-E14)/E11*100))","v":" "},null,{"$f":"IF(ISBLANK(G10),\" \",IF(ISBLANK(G14),\" \",(G11-G14)/G11*100))","v":" "},null,{"$f":"IF(ISBLANK(I10),\" \",IF(ISBLANK(I14),\" \",(I11-I14)/I11*100))","v":" "},null,{"$f":"IF(ISBLANK(K10),\" \",IF(ISBLANK(K14),\" \",(K11-K14)/K11*100))","v":" "},null,{"$f":"IF(ISBLANK(M10),\" \",IF(ISBLANK(M14),\" \",(M11-M14)/M11*100))","v":" "}]
["Wt. Loss",null,{"$f":"IF(ISBLANK(C10),\" \",IF(ISBLANK(C11),\" \",C10-C11))","v":" "},null,{"$f":"IF(ISBLANK(E10),\" \",IF(ISBLANK(E11),\" \",E10-E11))","v":" "},null,{"$f":"IF(ISBLANK(G10),\" \",IF(ISBLANK(G11),\" \",G10-G11))","v":" "},null,{"$f":"IF(ISBLANK(I10),\" \",IF(ISBLANK(I11),\" \",I10-I11))","v":" "},null,{"$f":"IF(ISBLANK(K10),\" \",IF(ISBLANK(K11),\" \",K10-K11))","v":" "},null,{"$f":"IF(ISBLANK(M10),\" \",IF(ISBLANK(M11),\" \",M10-M11))","v":" "}]
["Spec","Sieve","Wt","% Passing","Wt","% Passing","Wt","% Passing","Wt","% Passing","Wt","% Passing","Wt","% Passing"]
[{"$f":"'S1'!A14","v":"100"},0.375,null,{"$f":"IF(ISBLANK(C$10),\"  \",IF(ISBLANK(C$11),\" \",IF(ISBLANK(C14),\" \",ROUND((C14+C$12)/C$10*100,1))))","v":"  "},null,{"$f":"IF(ISBLANK(E$10),\"  \",IF(ISBLANK(E$11),\" \",IF(ISBLANK(E14),\" \",ROUND((E14+E$12)/E$10*100,1))))","v":"  "},null,{"$f":"IF(ISBLANK(G$10),\"  \",IF(ISBLANK(G$11),\" \",IF(ISBLANK(G14),\" \",ROUND((G14+G$12)/G$10*100,1))))","v":"  "},null,{"$f":"IF(ISBLANK(I$10),\"  \",IF(ISBLANK(I$11),\" \",IF(ISBLANK(I14),\" \",ROUND((I14+I$12)/I$10*100,1))))","v":"  "},null,{"$f":"IF(ISBLANK(K$10),\"  \",IF(ISBLANK(K$11),\" \",IF(ISBLANK(K14),\" \",ROUND((K14+K$12)/K$10*100,1))))","v":"  "},null,{"$f":"IF(ISBLANK(M$10),\"  \",IF(ISBLANK(M$11),\" \",IF(ISBLANK(M14),\" \",ROUND((M14+M$12)/M$10*100,1))))","v":"  "}]
[{"$f":"'S1'!A15","v":"Breaker"},0.25,null,{"$f":"IF(ISBLANK(C$10),\"  \",IF(ISBLANK(C$11),\" \",IF(ISBLANK(C15),\" \",ROUND((C15+C$12)/C$10*100,0))))","v":"  "},null,{"$f":"IF(ISBLANK(E$10),\"  \",IF(ISBLANK(E$11),\" \",IF(ISBLANK(E15),\" \",ROUND((E15+E$12)/E$10*100,0))))","v":"  "},null,{"$f":"IF(ISBLANK(G$10),\"  \",IF(ISBLANK(G$11),\" \",IF(ISBLANK(G15),\" \",ROUND((G15+G$12)/G$10*100,0))))","v":"  "},null,{"$f":"IF(ISBLANK(I$10),\"  \",IF(ISBLANK(I$11),\" \",IF(ISBLANK(I15),\" \",ROUND((I15+I$12)/I$10*100,0))))","v":"  "},null,{"$f":"IF(ISBLANK(K$10),\"  \",IF(ISBLANK(K$11),\" \",IF(ISBLANK(K15),\" \",ROUND((K15+K$12)/K$10*100,0))))","v":"  "},null,{"$f":"IF(ISBLANK(M$10),\"  \",IF(ISBLANK(M$11),\" \",IF(ISBLANK(M15),\" \",ROUND((M15+M$12)/M$10*100,0))))","v":"  "}]
[{"$f":"'S1'!A16","v":"85-100"},4,null,{"$f":"IF(ISBLANK(C$10),\"  \",IF(ISBLANK(C$11),\" \",IF(ISBLANK(C16),\" \",ROUND((C16+C$12)/C$10*100,0))))","v":"  "},null,{"$f":"IF(ISBLANK(E$10),\"  \",IF(ISBLANK(E$11),\" \",IF(ISBLANK(E16),\" \",ROUND((E16+E$12)/E$10*100,0))))","v":"  "},null,{"$f":"IF(ISBLANK(G$10),\"  \",IF(ISBLANK(G$11),\" \",IF(ISBLANK(G16),\" \",ROUND((G16+G$12)/G$10*100,0))))","v":"  "},null,{"$f":"IF(ISBLANK(I$10),\"  \",IF(ISBLANK(I$11),\" \",IF(ISBLANK(I16),\" \",ROUND((I16+I$12)/I$10*100,0))))","v":"  "},null,{"$f":"IF(ISBLANK(K$10),\"  \",IF(ISBLANK(K$11),\" \",IF(ISBLANK(K16),\" \",ROUND((K16+K$12)/K$10*100,0))))","v":"  "},null,{"$f":"IF(ISBLANK(M$10),\"  \",IF(ISBLANK(M$11),\" \",IF(ISBLANK(M16),\" \",ROUND((M16+M$12)/M$10*100,0))))","v":"  "}]
[{"$f":"'S1'!A17","v":"0-55"},8,null,{"$f":"IF(ISBLANK(C$10),\"  \",IF(ISBLANK(C$11),\" \",IF(ISBLANK(C17),\" \",ROUND((C17+C$12)/C$10*100,0))))","v":"  "},null,{"$f":"IF(ISBLANK(E$10),\"  \",IF(ISBLANK(E$11),\" \",IF(ISBLANK(E17),\" \",ROUND((E17+E$12)/E$10*100,0))))","v":"  "},null,{"$f":"IF(ISBLANK(G$10),\"  \",IF(ISBLANK(G$11),\" \",IF(ISBLANK(G17),\" \",ROUND((G17+G$12)/G$10*100,0))))","v":"  "},null,{"$f":"IF(ISBLANK(I$10),\"  \",IF(ISBLANK(I$11),\" \",IF(ISBLANK(I17),\" \",ROUND((I17+I$12)/I$10*100,0))))","v":"  "},null,{"$f":"IF(ISBLANK(K$10),\"  \",IF(ISBLANK(K$11),\" \",IF(ISBLANK(K17),\" \",ROUND((K17+K$12)/K$10*100,0))))","v":"  "},null,{"$f":"IF(ISBLANK(M$10),\"  \",IF(ISBLANK(M$11),\" \",IF(ISBLANK(M17),\" \",ROUND((M17+M$12)/M$10*100,0))))","v":"  "}]
[{"$f":"'S1'!A18","v":"0-5"},100,null,{"$f":"IF(ISBLANK(C$10),\"  \",IF(ISBLANK(C$11),\" \",IF(ISBLANK(C18),\" \",ROUND((C18+C$12)/C$10*100,0))))","v":"  "},null,{"$f":"IF(ISBLANK(E$10),\"  \",IF(ISBLANK(E$11),\" \",IF(ISBLANK(E18),\" \",ROUND((E18+E$12)/E$10*100,0))))","v":"  "},null,{"$f":"IF(ISBLANK(G$10),\"  \",IF(ISBLANK(G$11),\" \",IF(ISBLANK(G18),\" \",ROUND((G18+G$12)/G$10*100,0))))","v":"  "},null,{"$f":"IF(ISBLANK(I$10),\"  \",IF(ISBLANK(I$11),\" \",IF(ISBLANK(I18),\" \",ROUND((I18+I$12)/I$10*100,0))))","v":"  "},null,{"$f":"IF(ISBLANK(K$10),\"  \",IF(ISBLANK(K$11),\" \",IF(ISBLANK(K18),\" \",ROUND((K18+K$12)/K$10*100,0))))","v":"  "},null,{"$f":"IF(ISBLANK(M$10),\"  \",IF(ISBLANK(M$11),\" \",IF(ISBLANK(M18),\" \",ROUND((M18+M$12)/M$10*100,0))))","v":"  "}]
[{"$f":"'S1'!A19","v":"0-4"},200,null,{"$f":"IF(ISBLANK(C$10),\"  \",IF(ISBLANK(C$11),\" \",IF(ISBLANK(C19),\" \",ROUND((C19+C$12)/C$10*100,2))))","v":"  "},null,{"$f":"IF(ISBLANK(E$10),\"  \",IF(ISBLANK(E$11),\" \",IF(ISBLANK(E19),\" \",ROUND((E19+E$12)/E$10*100,2))))","v":"  "},null,{"$f":"IF(ISBLANK(G$10),\"  \",IF(ISBLANK(G$11),\" \",IF(ISBLANK(G19),\" \",ROUND((G19+G$12)/G$10*100,2))))","v":"  "},null,{"$f":"IF(ISBLANK(I$10),\"  \",IF(ISBLANK(I$11),\" \",IF(ISBLANK(I19),\" \",ROUND((I19+I$12)/I$10*100,2))))","v":"  "},null,{"$f":"IF(ISBLANK(K$10),\"  \",IF(ISBLANK(K$11),\" \",IF(ISBLANK(K19),\" \",ROUND((K19+K$12)/K$10*100,2))))","v":"  "},null,{"$f":"IF(ISBLANK(M$10),\"  \",IF(ISBLANK(M$11),\" \",IF(ISBLANK(M19),\" \",ROUND((M19+M$12)/M$10*100,2))))","v":"  "}]
["Tested By"]
["Remarks"]
[]
[]
[]
[]
["Sample No."]
["Date"]
["St Wt Before Wash",null,null,"% Loss",null,"% Loss",null,"% Loss",null,"% Loss",null,"% Loss",null,"% Loss"]
["Dry Wt After Wash",null,null,{"$f":"IF(ISBLANK(C28),\" \",IF(ISBLANK(C32),\" \",(C29-C32)/C29*100))","v":" "},null,{"$f":"IF(ISBLANK(E28),\" \",IF(ISBLANK(E32),\" \",(E29-E32)/E29*100))","v":" "},null,{"$f":"IF(ISBLANK(G28),\" \",IF(ISBLANK(G32),\" \",(G29-G32)/G29*100))","v":" "},null,{"$f":"IF(ISBLANK(I28),\" \",IF(ISBLANK(I32),\" \",(I29-I32)/I29*100))","v":" "},null,{"$f":"IF(ISBLANK(K28),\" \",IF(ISBLANK(K32),\" \",(K29-K32)/K29*100))","v":" "},null,{"$f":"IF(ISBLANK(M28),\" \",IF(ISBLANK(M32),\" \",(M29-M32)/M29*100))","v":" "}]
["Wt. Loss",null,{"$f":"IF(ISBLANK(C28),\" \",IF(ISBLANK(C29),\" \",C28-C29))","v":" "},null,{"$f":"IF(ISBLANK(E28),\" \",IF(ISBLANK(E29),\" \",E28-E29))","v":" "},null,{"$f":"IF(ISBLANK(G28),\" \",IF(ISBLANK(G29),\" \",G28-G29))","v":" "},null,{"$f":"IF(ISBLANK(I28),\" \",IF(ISBLANK(I29),\" \",I28-I29))","v":" "},null,{"$f":"IF(ISBLANK(K28),\" \",IF(ISBLANK(K29),\" \",K28-K29))","v":" "},null,{"$f":"IF(ISBLANK(M28),\" \",IF(ISBLANK(M29),\" \",M28-M29))","v":" "}]
["Spec","Sieve","Wt","% Passing","Wt","% Passing","Wt","% Passing","Wt","% Passing","Wt","% Passing","Wt","% Passing"]
[{"$f":"'S1'!A32","v":100},0.375,null,{"$f":"IF(ISBLANK(C$28),\"  \",IF(ISBLANK(C$29),\" \",IF(ISBLANK(C32),\" \",ROUND((C32+C$30)/C$28*100,1))))","v":"  "},null,{"$f":"IF(ISBLANK(E$28),\"  \",IF(ISBLANK(E$29),\" \",IF(ISBLANK(E32),\" \",ROUND((E32+E$30)/E$28*100,1))))","v":"  "},null,{"$f":"IF(ISBLANK(G$28),\"  \",IF(ISBLANK(G$29),\" \",IF(ISBLANK(G32),\" \",ROUND((G32+G$30)/G$28*100,1))))","v":"  "},null,{"$f":"IF(ISBLANK(I$28),\"  \",IF(ISBLANK(I$29),\" \",IF(ISBLANK(I32),\" \",ROUND((I32+I$30)/I$28*100,1))))","v":"  "},null,{"$f":"IF(ISBLANK(K$28),\"  \",IF(ISBLANK(K$29),\" \",IF(ISBLANK(K32),\" \",ROUND((K32+K$30)/K$28*100,1))))","v":"  "},null,{"$f":"IF(ISBLANK(M$28),\"  \",IF(ISBLANK(M$29),\" \",IF(ISBLANK(M32),\" \",ROUND((M32+M$30)/M$28*100,1))))","v":"  "}]
[{"$f":"'S1'!A33","v":"Breaker"},0.25,null,{"$f":"IF(ISBLANK(C$28),\"  \",IF(ISBLANK(C$29),\" \",IF(ISBLANK(C33),\" \",ROUND((C33+C$30)/C$28*100,0))))","v":"  "},null,{"$f":"IF(ISBLANK(E$28),\"  \",IF(ISBLANK(E$29),\" \",IF(ISBLANK(E33),\" \",ROUND((E33+E$30)/E$28*100,0))))","v":"  "},null,{"$f":"IF(ISBLANK(G$28),\"  \",IF(ISBLANK(G$29),\" \",IF(ISBLANK(G33),\" \",ROUND((G33+G$30)/G$28*100,0))))","v":"  "},null,{"$f":"IF(ISBLANK(I$28),\"  \",IF(ISBLANK(I$29),\" \",IF(ISBLANK(I33),\" \",ROUND((I33+I$30)/I$28*100,0))))","v":"  "},null,{"$f":"IF(ISBLANK(K$28),\"  \",IF(ISBLANK(K$29),\" \",IF(ISBLANK(K33),\" \",ROUND((K33+K$30)/K$28*100,0))))","v":"  "},null,{"$f":"IF(ISBLANK(M$28),\"  \",IF(ISBLANK(M$29),\" \",IF(ISBLANK(M33),\" \",ROUND((M33+M$30)/M$28*100,0))))","v":"  "}]
[{"$f":"'S1'!A34","v":"85-100"},4,null,{"$f":"IF(ISBLANK(C$28),\"  \",IF(ISBLANK(C$29),\" \",IF(ISBLANK(C34),\" \",ROUND((C34+C$30)/C$28*100,0))))","v":"  "},null,{"$f":"IF(ISBLANK(E$28),\"  \",IF(ISBLANK(E$29),\" \",IF(ISBLANK(E34),\" \",ROUND((E34+E$30)/E$28*100,0))))","v":"  "},null,{"$f":"IF(ISBLANK(G$28),\"  \",IF(ISBLANK(G$29),\" \",IF(ISBLANK(G34),\" \",ROUND((G34+G$30)/G$28*100,0))))","v":"  "},null,{"$f":"IF(ISBLANK(I$28),\"  \",IF(ISBLANK(I$29),\" \",IF(ISBLANK(I34),\" \",ROUND((I34+I$30)/I$28*100,0))))","v":"  "},null,{"$f":"IF(ISBLANK(K$28),\"  \",IF(ISBLANK(K$29),\" \",IF(ISBLANK(K34),\" \",ROUND((K34+K$30)/K$28*100,0))))","v":"  "},null,{"$f":"IF(ISBLANK(M$28),\"  \",IF(ISBLANK(M$29),\" \",IF(ISBLANK(M34),\" \",ROUND((M34+M$30)/M$28*100,0))))","v":"  "}]
[{"$f":"'S1'!A35","v":"0-55"},8,null,{"$f":"IF(ISBLANK(C$28),\"  \",IF(ISBLANK(C$29),\" \",IF(ISBLANK(C35),\" \",ROUND((C35+C$30)/C$28*100,0))))","v":"  "},null,{"$f":"IF(ISBLANK(E$28),\"  \",IF(ISBLANK(E$29),\" \",IF(ISBLANK(E35),\" \",ROUND((E35+E$30)/E$28*100,0))))","v":"  "},null,{"$f":"IF(ISBLANK(G$28),\"  \",IF(ISBLANK(G$29),\" \",IF(ISBLANK(G35),\" \",ROUND((G35+G$30)/G$28*100,0))))","v":"  "},null,{"$f":"IF(ISBLANK(I$28),\"  \",IF(ISBLANK(I$29),\" \",IF(ISBLANK(I35),\" \",ROUND((I35+I$30)/I$28*100,0))))","v":"  "},null,{"$f":"IF(ISBLANK(K$28),\"  \",IF(ISBLANK(K$29),\" \",IF(ISBLANK(K35),\" \",ROUND((K35+K$30)/K$28*100,0))))","v":"  "},null,{"$f":"IF(ISBLANK(M$28),\"  \",IF(ISBLANK(M$29),\" \",IF(ISBLANK(M35),\" \",ROUND((M35+M$30)/M$28*100,0))))","v":"  "}]
[{"$f":"'S1'!A36","v":"0-5"},100,null,{"$f":"IF(ISBLANK(C$28),\"  \",IF(ISBLANK(C$29),\" \",IF(ISBLANK(C36),\" \",ROUND((C36+C$30)/C$28*100,0))))","v":"  "},null,{"$f":"IF(ISBLANK(E$28),\"  \",IF(ISBLANK(E$29),\" \",IF(ISBLANK(E36),\" \",ROUND((E36+E$30)/E$28*100,0))))","v":"  "},null,{"$f":"IF(ISBLANK(G$28),\"  \",IF(ISBLANK(G$29),\" \",IF(ISBLANK(G36),\" \",ROUND((G36+G$30)/G$28*100,0))))","v":"  "},null,{"$f":"IF(ISBLANK(I$28),\"  \",IF(ISBLANK(I$29),\" \",IF(ISBLANK(I36),\" \",ROUND((I36+I$30)/I$28*100,0))))","v":"  "},null,{"$f":"IF(ISBLANK(K$28),\"  \",IF(ISBLANK(K$29),\" \",IF(ISBLANK(K36),\" \",ROUND((K36+K$30)/K$28*100,0))))","v":"  "},null,{"$f":"IF(ISBLANK(M$28),\"  \",IF(ISBLANK(M$29),\" \",IF(ISBLANK(M36),\" \",ROUND((M36+M$30)/M$28*100,0))))","v":"  "}]
[{"$f":"'S1'!A37","v":"0-4"},200,null,{"$f":"IF(ISBLANK(C$28),\"  \",IF(ISBLANK(C$29),\" \",IF(ISBLANK(C37),\" \",ROUND((C37+C$30)/C$28*100,2))))","v":"  "},null,{"$f":"IF(ISBLANK(E$28),\"  \",IF(ISBLANK(E$29),\" \",IF(ISBLANK(E37),\" \",ROUND((E37+E$30)/E$28*100,2))))","v":"  "},null,{"$f":"IF(ISBLANK(G$28),\"  \",IF(ISBLANK(G$29),\" \",IF(ISBLANK(G37),\" \",ROUND((G37+G$30)/G$28*100,2))))","v":"  "},null,{"$f":"IF(ISBLANK(I$28),\"  \",IF(ISBLANK(I$29),\" \",IF(ISBLANK(I37),\" \",ROUND((I37+I$30)/I$28*100,2))))","v":"  "},null,{"$f":"IF(ISBLANK(K$28),\"  \",IF(ISBLANK(K$29),\" \",IF(ISBLANK(K37),\" \",ROUND((K37+K$30)/K$28*100,2))))","v":"  "},null,{"$f":"IF(ISBLANK(M$28),\"  \",IF(ISBLANK(M$29),\" \",IF(ISBLANK(M37),\" \",ROUND((M37+M$30)/M$28*100,2))))","v":"  "}]
["Tested By"]
["Remarks"]

{"sheet":"S3","index":2,"n_rows":39,"n_cols":14,"rows_kept":39,"cut":false,"hidden":true,"merged":[[4,0,4,1],[37,2,37,3],[29,12,29,13],[37,12,37,13],[38,0,41,1],[38,2,41,3],[38,4,41,5],[38,6,41,7],[38,8,41,9],[38,10,41,11],[38,12,41,13],[29,4,29,5],[29,6,29,7],[29,8,29,9],[37,10,37,11],[37,4,37,5],[37,6,37,7],[37,8,37,9],[11,0,11,1],[11,2,11,3],[20,8,23,9],[19,0,19,1],[37,0,37,1],[19,4,19,5],[19,6,19,7],[19,8,19,9],[29,0,29,1],[20,10,23,11],[26,8,26,9],[26,10,26,11],[28,0,28,1],[27,0,27,1],[25,0,25,1],[26,0,26,1],[25,10,25,11],[20,0,23,1],[20,2,23,3],[20,4,23,5],[26,4,26,5],[26,6,26,7],[25,4,25,5],[25,6,25,7],[25,8,25,9],[20,12,23,13],[25,12,25,13],[26,12,26,13],[29,2,29,3],[11,10,11,11],[11,12,11,13],[11,4,11,5],[11,6,11,7],[11,8,11,9],[19,12,19,13],[29,10,29,11],[20,6,23,7],[26,2,26,3],[19,2,19,3],[25,2,25,3],[19,10,19,11],[10,0,10,1],[9,0,9,1],[7,10,7,11],[7,12,7,13],[8,0,8,1],[8,2,8,3],[8,4,8,5],[8,6,8,7],[8,8,8,9],[8,10,8,11],[8,12,8,13],[5,3,5,8],[7,0,7,1],[7,2,7,3],[7,4,7,5],[7,6,7,7],[7,8,7,9],[3,10,3,11],[3,12,3,13],[0,0,3,1],[1,10,1,11],[1,12,1,13],[2,10,2,11],[2,12,2,13],[0,8,3,9],[1,2,1,7],[2,2,2,7],[3,2,3,7]]}
[]
[null,null,"COMMONWEALTH OF PENNSYLVANIA",null,null,null,null,null,null,null,"DISTRICT",null,{"$f":"IF(ISBLANK('S1'!L2),\"\",'S1'!L2)","v":""}]
[null,null,"DEPARTMENT OF TRANSPORTATION",null,null,null,null,null,null,null,"PLANT CODE",null,{"$f":"IF(ISBLANK('S1'!L3),\"\",'S1'!L3)","v":""}]
[null,null,"PENNSYLVANIA TURNPIKE COMMISSION",null,null,null,null,null,null,null,"AGG SIZE",null,{"$f":"IF(ISBLANK('S1'!L4),\"\",'S1'!L4)","v":"Type 3B"}]
[{"$f":"'S1'!A5","v":"Aggregate 2023"}]
[null,null,null,{"$f":"'S1'!D6","v":"Material Test Results for Type 3B Anti-Skid"}]
[]
["Sample No."]
["Date"]
["St Wt Before Wash",null,null,"% Loss",null,"% Loss",null,"% Loss",null,"% Loss",null,"% Loss",null,"% Loss"]
["Dry Wt After Wash",null,null,{"$f":"IF(ISBLANK(C10),\" \",IF(ISBLANK(C14),\" \",(C11-C14)/C11*100))","v":" "},null,{"$f":"IF(ISBLANK(E10),\" \",IF(ISBLANK(E14),\" \",(E11-E14)/E11*100))","v":" "},null,{"$f":"IF(ISBLANK(G10),\" \",IF(ISBLANK(G14),\" \",(G11-G14)/G11*100))","v":" "},null,{"$f":"IF(ISBLANK(I10),\" \",IF(ISBLANK(I14),\" \",(I11-I14)/I11*100))","v":" "},null,{"$f":"IF(ISBLANK(K10),\" \",IF(ISBLANK(K14),\" \",(K11-K14)/K11*100))","v":" "},null,{"$f":"IF(ISBLANK(M10),\" \",IF(ISBLANK(M14),\" \",(M11-M14)/M11*100))","v":" "}]
["Wt. Loss",null,{"$f":"IF(ISBLANK(C10),\" \",IF(ISBLANK(C11),\" \",C10-C11))","v":" "},null,{"$f":"IF(ISBLANK(E10),\" \",IF(ISBLANK(E11),\" \",E10-E11))","v":" "},null,{"$f":"IF(ISBLANK(G10),\" \",IF(ISBLANK(G11),\" \",G10-G11))","v":" "},null,{"$f":"IF(ISBLANK(I10),\" \",IF(ISBLANK(I11),\" \",I10-I11))","v":" "},null,{"$f":"IF(ISBLANK(K10),\" \",IF(ISBLANK(K11),\" \",K10-K11))","v":" "},null,{"$f":"IF(ISBLANK(M10),\" \",IF(ISBLANK(M11),\" \",M10-M11))","v":" "}]
["Spec","Sieve","Wt","% Passing","Wt","% Passing","Wt","% Passing","Wt","% Passing","Wt","% Passing","Wt","% Passing"]
[{"$f":"'S1'!A14","v":"100"},0.375,null,{"$f":"IF(ISBLANK(C$10),\"  \",IF(ISBLANK(C$11),\" \",IF(ISBLANK(C14),\" \",ROUND((C14+C$12)/C$10*100,1))))","v":"  "},null,{"$f":"IF(ISBLANK(E$10),\"  \",IF(ISBLANK(E$11),\" \",IF(ISBLANK(E14),\" \",ROUND((E14+E$12)/E$10*100,1))))","v":"  "},null,{"$f":"IF(ISBLANK(G$10),\"  \",IF(ISBLANK(G$11),\" \",IF(ISBLANK(G14),\" \",ROUND((G14+G$12)/G$10*100,1))))","v":"  "},null,{"$f":"IF(ISBLANK(I$10),\"  \",IF(ISBLANK(I$11),\" \",IF(ISBLANK(I14),\" \",ROUND((I14+I$12)/I$10*100,1))))","v":"  "},null,{"$f":"IF(ISBLANK(K$10),\"  \",IF(ISBLANK(K$11),\" \",IF(ISBLANK(K14),\" \",ROUND((K14+K$12)/K$10*100,1))))","v":"  "},null,{"$f":"IF(ISBLANK(M$10),\"  \",IF(ISBLANK(M$11),\" \",IF(ISBLANK(M14),\" \",ROUND((M14+M$12)/M$10*100,1))))","v":"  "}]
[{"$f":"'S1'!A15","v":"Breaker"},0.25,null,{"$f":"IF(ISBLANK(C$10),\"  \",IF(ISBLANK(C$11),\" \",IF(ISBLANK(C15),\" \",ROUND((C15+C$12)/C$10*100,0))))","v":"  "},null,{"$f":"IF(ISBLANK(E$10),\"  \",IF(ISBLANK(E$11),\" \",IF(ISBLANK(E15),\" \",ROUND((E15+E$12)/E$10*100,0))))","v":"  "},null,{"$f":"IF(ISBLANK(G$10),\"  \",IF(ISBLANK(G$11),\" \",IF(ISBLANK(G15),\" \",ROUND((G15+G$12)/G$10*100,0))))","v":"  "},null,{"$f":"IF(ISBLANK(I$10),\"  \",IF(ISBLANK(I$11),\" \",IF(ISBLANK(I15),\" \",ROUND((I15+I$12)/I$10*100,0))))","v":"  "},null,{"$f":"IF(ISBLANK(K$10),\"  \",IF(ISBLANK(K$11),\" \",IF(ISBLANK(K15),\" \",ROUND((K15+K$12)/K$10*100,0))))","v":"  "},null,{"$f":"IF(ISBLANK(M$10),\"  \",IF(ISBLANK(M$11),\" \",IF(ISBLANK(M15),\" \",ROUND((M15+M$12)/M$10*100,0))))","v":"  "}]
[{"$f":"'S1'!A16","v":"85-100"},4,null,{"$f":"IF(ISBLANK(C$10),\"  \",IF(ISBLANK(C$11),\" \",IF(ISBLANK(C16),\" \",ROUND((C16+C$12)/C$10*100,0))))","v":"  "},null,{"$f":"IF(ISBLANK(E$10),\"  \",IF(ISBLANK(E$11),\" \",IF(ISBLANK(E16),\" \",ROUND((E16+E$12)/E$10*100,0))))","v":"  "},null,{"$f":"IF(ISBLANK(G$10),\"  \",IF(ISBLANK(G$11),\" \",IF(ISBLANK(G16),\" \",ROUND((G16+G$12)/G$10*100,0))))","v":"  "},null,{"$f":"IF(ISBLANK(I$10),\"  \",IF(ISBLANK(I$11),\" \",IF(ISBLANK(I16),\" \",ROUND((I16+I$12)/I$10*100,0))))","v":"  "},null,{"$f":"IF(ISBLANK(K$10),\"  \",IF(ISBLANK(K$11),\" \",IF(ISBLANK(K16),\" \",ROUND((K16+K$12)/K$10*100,0))))","v":"  "},null,{"$f":"IF(ISBLANK(M$10),\"  \",IF(ISBLANK(M$11),\" \",IF(ISBLANK(M16),\" \",ROUND((M16+M$12)/M$10*100,0))))","v":"  "}]
[{"$f":"'S1'!A17","v":"0-55"},8,null,{"$f":"IF(ISBLANK(C$10),\"  \",IF(ISBLANK(C$11),\" \",IF(ISBLANK(C17),\" \",ROUND((C17+C$12)/C$10*100,0))))","v":"  "},null,{"$f":"IF(ISBLANK(E$10),\"  \",IF(ISBLANK(E$11),\" \",IF(ISBLANK(E17),\" \",ROUND((E17+E$12)/E$10*100,0))))","v":"  "},null,{"$f":"IF(ISBLANK(G$10),\"  \",IF(ISBLANK(G$11),\" \",IF(ISBLANK(G17),\" \",ROUND((G17+G$12)/G$10*100,0))))","v":"  "},null,{"$f":"IF(ISBLANK(I$10),\"  \",IF(ISBLANK(I$11),\" \",IF(ISBLANK(I17),\" \",ROUND((I17+I$12)/I$10*100,0))))","v":"  "},null,{"$f":"IF(ISBLANK(K$10),\"  \",IF(ISBLANK(K$11),\" \",IF(ISBLANK(K17),\" \",ROUND((K17+K$12)/K$10*100,0))))","v":"  "},null,{"$f":"IF(ISBLANK(M$10),\"  \",IF(ISBLANK(M$11),\" \",IF(ISBLANK(M17),\" \",ROUND((M17+M$12)/M$10*100,0))))","v":"  "}]
[{"$f":"'S1'!A18","v":"0-5"},100,null,{"$f":"IF(ISBLANK(C$10),\"  \",IF(ISBLANK(C$11),\" \",IF(ISBLANK(C18),\" \",ROUND((C18+C$12)/C$10*100,0))))","v":"  "},null,{"$f":"IF(ISBLANK(E$10),\"  \",IF(ISBLANK(E$11),\" \",IF(ISBLANK(E18),\" \",ROUND((E18+E$12)/E$10*100,0))))","v":"  "},null,{"$f":"IF(ISBLANK(G$10),\"  \",IF(ISBLANK(G$11),\" \",IF(ISBLANK(G18),\" \",ROUND((G18+G$12)/G$10*100,0))))","v":"  "},null,{"$f":"IF(ISBLANK(I$10),\"  \",IF(ISBLANK(I$11),\" \",IF(ISBLANK(I18),\" \",ROUND((I18+I$12)/I$10*100,0))))","v":"  "},null,{"$f":"IF(ISBLANK(K$10),\"  \",IF(ISBLANK(K$11),\" \",IF(ISBLANK(K18),\" \",ROUND((K18+K$12)/K$10*100,0))))","v":"  "},null,{"$f":"IF(ISBLANK(M$10),\"  \",IF(ISBLANK(M$11),\" \",IF(ISBLANK(M18),\" \",ROUND((M18+M$12)/M$10*100,0))))","v":"  "}]
[{"$f":"'S1'!A19","v":"0-4"},200,null,{"$f":"IF(ISBLANK(C$10),\"  \",IF(ISBLANK(C$11),\" \",IF(ISBLANK(C19),\" \",ROUND((C19+C$12)/C$10*100,2))))","v":"  "},null,{"$f":"IF(ISBLANK(E$10),\"  \",IF(ISBLANK(E$11),\" \",IF(ISBLANK(E19),\" \",ROUND((E19+E$12)/E$10*100,2))))","v":"  "},null,{"$f":"IF(ISBLANK(G$10),\"  \",IF(ISBLANK(G$11),\" \",IF(ISBLANK(G19),\" \",ROUND((G19+G$12)/G$10*100,2))))","v":"  "},null,{"$f":"IF(ISBLANK(I$10),\"  \",IF(ISBLANK(I$11),\" \",IF(ISBLANK(I19),\" \",ROUND((I19+I$12)/I$10*100,2))))","v":"  "},null,{"$f":"IF(ISBLANK(K$10),\"  \",IF(ISBLANK(K$11),\" \",IF(ISBLANK(K19),\" \",ROUND((K19+K$12)/K$10*100,2))))","v":"  "},null,{"$f":"IF(ISBLANK(M$10),\"  \",IF(ISBLANK(M$11),\" \",IF(ISBLANK(M19),\" \",ROUND((M19+M$12)/M$10*100,2))))","v":"  "}]
["Tested By"]
["Remarks"]
[]
[]
[]
[]
["Sample No."]
["Date"]
["St Wt Before Wash",null,null,"% Loss",null,"% Loss",null,"% Loss",null,"% Loss",null,"% Loss",null,"% Loss"]
["Dry Wt After Wash",null,null,{"$f":"IF(ISBLANK(C28),\" \",IF(ISBLANK(C32),\" \",(C29-C32)/C29*100))","v":" "},null,{"$f":"IF(ISBLANK(E28),\" \",IF(ISBLANK(E32),\" \",(E29-E32)/E29*100))","v":" "},null,{"$f":"IF(ISBLANK(G28),\" \",IF(ISBLANK(G32),\" \",(G29-G32)/G29*100))","v":" "},null,{"$f":"IF(ISBLANK(I28),\" \",IF(ISBLANK(I32),\" \",(I29-I32)/I29*100))","v":" "},null,{"$f":"IF(ISBLANK(K28),\" \",IF(ISBLANK(K32),\" \",(K29-K32)/K29*100))","v":" "},null,{"$f":"IF(ISBLANK(M28),\" \",IF(ISBLANK(M32),\" \",(M29-M32)/M29*100))","v":" "}]
["Wt. Loss",null,{"$f":"IF(ISBLANK(C28),\" \",IF(ISBLANK(C29),\" \",C28-C29))","v":" "},null,{"$f":"IF(ISBLANK(E28),\" \",IF(ISBLANK(E29),\" \",E28-E29))","v":" "},null,{"$f":"IF(ISBLANK(G28),\" \",IF(ISBLANK(G29),\" \",G28-G29))","v":" "},null,{"$f":"IF(ISBLANK(I28),\" \",IF(ISBLANK(I29),\" \",I28-I29))","v":" "},null,{"$f":"IF(ISBLANK(K28),\" \",IF(ISBLANK(K29),\" \",K28-K29))","v":" "},null,{"$f":"IF(ISBLANK(M28),\" \",IF(ISBLANK(M29),\" \",M28-M29))","v":" "}]
["Spec","Sieve","Wt","% Passing","Wt","% Passing","Wt","% Passing","Wt","% Passing","Wt","% Passing","Wt","% Passing"]
[{"$f":"'S1'!A32","v":100},0.375,null,{"$f":"IF(ISBLANK(C$28),\"  \",IF(ISBLANK(C$29),\" \",IF(ISBLANK(C32),\" \",ROUND((C32+C$30)/C$28*100,1))))","v":"  "},null,{"$f":"IF(ISBLANK(E$28),\"  \",IF(ISBLANK(E$29),\" \",IF(ISBLANK(E32),\" \",ROUND((E32+E$30)/E$28*100,1))))","v":"  "},null,{"$f":"IF(ISBLANK(G$28),\"  \",IF(ISBLANK(G$29),\" \",IF(ISBLANK(G32),\" \",ROUND((G32+G$30)/G$28*100,1))))","v":"  "},null,{"$f":"IF(ISBLANK(I$28),\"  \",IF(ISBLANK(I$29),\" \",IF(ISBLANK(I32),\" \",ROUND((I32+I$30)/I$28*100,1))))","v":"  "},null,{"$f":"IF(ISBLANK(K$28),\"  \",IF(ISBLANK(K$29),\" \",IF(ISBLANK(K32),\" \",ROUND((K32+K$30)/K$28*100,1))))","v":"  "},null,{"$f":"IF(ISBLANK(M$28),\"  \",IF(ISBLANK(M$29),\" \",IF(ISBLANK(M32),\" \",ROUND((M32+M$30)/M$28*100,1))))","v":"  "}]
[{"$f":"'S1'!A33","v":"Breaker"},0.25,null,{"$f":"IF(ISBLANK(C$28),\"  \",IF(ISBLANK(C$29),\" \",IF(ISBLANK(C33),\" \",ROUND((C33+C$30)/C$28*100,0))))","v":"  "},null,{"$f":"IF(ISBLANK(E$28),\"  \",IF(ISBLANK(E$29),\" \",IF(ISBLANK(E33),\" \",ROUND((E33+E$30)/E$28*100,0))))","v":"  "},null,{"$f":"IF(ISBLANK(G$28),\"  \",IF(ISBLANK(G$29),\" \",IF(ISBLANK(G33),\" \",ROUND((G33+G$30)/G$28*100,0))))","v":"  "},null,{"$f":"IF(ISBLANK(I$28),\"  \",IF(ISBLANK(I$29),\" \",IF(ISBLANK(I33),\" \",ROUND((I33+I$30)/I$28*100,0))))","v":"  "},null,{"$f":"IF(ISBLANK(K$28),\"  \",IF(ISBLANK(K$29),\" \",IF(ISBLANK(K33),\" \",ROUND((K33+K$30)/K$28*100,0))))","v":"  "},null,{"$f":"IF(ISBLANK(M$28),\"  \",IF(ISBLANK(M$29),\" \",IF(ISBLANK(M33),\" \",ROUND((M33+M$30)/M$28*100,0))))","v":"  "}]
[{"$f":"'S1'!A34","v":"85-100"},4,null,{"$f":"IF(ISBLANK(C$28),\"  \",IF(ISBLANK(C$29),\" \",IF(ISBLANK(C34),\" \",ROUND((C34+C$30)/C$28*100,0))))","v":"  "},null,{"$f":"IF(ISBLANK(E$28),\"  \",IF(ISBLANK(E$29),\" \",IF(ISBLANK(E34),\" \",ROUND((E34+E$30)/E$28*100,0))))","v":"  "},null,{"$f":"IF(ISBLANK(G$28),\"  \",IF(ISBLANK(G$29),\" \",IF(ISBLANK(G34),\" \",ROUND((G34+G$30)/G$28*100,0))))","v":"  "},null,{"$f":"IF(ISBLANK(I$28),\"  \",IF(ISBLANK(I$29),\" \",IF(ISBLANK(I34),\" \",ROUND((I34+I$30)/I$28*100,0))))","v":"  "},null,{"$f":"IF(ISBLANK(K$28),\"  \",IF(ISBLANK(K$29),\" \",IF(ISBLANK(K34),\" \",ROUND((K34+K$30)/K$28*100,0))))","v":"  "},null,{"$f":"IF(ISBLANK(M$28),\"  \",IF(ISBLANK(M$29),\" \",IF(ISBLANK(M34),\" \",ROUND((M34+M$30)/M$28*100,0))))","v":"  "}]
[{"$f":"'S1'!A35","v":"0-55"},8,null,{"$f":"IF(ISBLANK(C$28),\"  \",IF(ISBLANK(C$29),\" \",IF(ISBLANK(C35),\" \",ROUND((C35+C$30)/C$28*100,0))))","v":"  "},null,{"$f":"IF(ISBLANK(E$28),\"  \",IF(ISBLANK(E$29),\" \",IF(ISBLANK(E35),\" \",ROUND((E35+E$30)/E$28*100,0))))","v":"  "},null,{"$f":"IF(ISBLANK(G$28),\"  \",IF(ISBLANK(G$29),\" \",IF(ISBLANK(G35),\" \",ROUND((G35+G$30)/G$28*100,0))))","v":"  "},null,{"$f":"IF(ISBLANK(I$28),\"  \",IF(ISBLANK(I$29),\" \",IF(ISBLANK(I35),\" \",ROUND((I35+I$30)/I$28*100,0))))","v":"  "},null,{"$f":"IF(ISBLANK(K$28),\"  \",IF(ISBLANK(K$29),\" \",IF(ISBLANK(K35),\" \",ROUND((K35+K$30)/K$28*100,0))))","v":"  "},null,{"$f":"IF(ISBLANK(M$28),\"  \",IF(ISBLANK(M$29),\" \",IF(ISBLANK(M35),\" \",ROUND((M35+M$30)/M$28*100,0))))","v":"  "}]
[{"$f":"'S1'!A36","v":"0-5"},100,null,{"$f":"IF(ISBLANK(C$28),\"  \",IF(ISBLANK(C$29),\" \",IF(ISBLANK(C36),\" \",ROUND((C36+C$30)/C$28*100,0))))","v":"  "},null,{"$f":"IF(ISBLANK(E$28),\"  \",IF(ISBLANK(E$29),\" \",IF(ISBLANK(E36),\" \",ROUND((E36+E$30)/E$28*100,0))))","v":"  "},null,{"$f":"IF(ISBLANK(G$28),\"  \",IF(ISBLANK(G$29),\" \",IF(ISBLANK(G36),\" \",ROUND((G36+G$30)/G$28*100,0))))","v":"  "},null,{"$f":"IF(ISBLANK(I$28),\"  \",IF(ISBLANK(I$29),\" \",IF(ISBLANK(I36),\" \",ROUND((I36+I$30)/I$28*100,0))))","v":"  "},null,{"$f":"IF(ISBLANK(K$28),\"  \",IF(ISBLANK(K$29),\" \",IF(ISBLANK(K36),\" \",ROUND((K36+K$30)/K$28*100,0))))","v":"  "},null,{"$f":"IF(ISBLANK(M$28),\"  \",IF(ISBLANK(M$29),\" \",IF(ISBLANK(M36),\" \",ROUND((M36+M$30)/M$28*100,0))))","v":"  "}]
[{"$f":"'S1'!A37","v":"0-4"},200,null,{"$f":"IF(ISBLANK(C$28),\"  \",IF(ISBLANK(C$29),\" \",IF(ISBLANK(C37),\" \",ROUND((C37+C$30)/C$28*100,2))))","v":"  "},null,{"$f":"IF(ISBLANK(E$28),\"  \",IF(ISBLANK(E$29),\" \",IF(ISBLANK(E37),\" \",ROUND((E37+E$30)/E$28*100,2))))","v":"  "},null,{"$f":"IF(ISBLANK(G$28),\"  \",IF(ISBLANK(G$29),\" \",IF(ISBLANK(G37),\" \",ROUND((G37+G$30)/G$28*100,2))))","v":"  "},null,{"$f":"IF(ISBLANK(I$28),\"  \",IF(ISBLANK(I$29),\" \",IF(ISBLANK(I37),\" \",ROUND((I37+I$30)/I$28*100,2))))","v":"  "},null,{"$f":"IF(ISBLANK(K$28),\"  \",IF(ISBLANK(K$29),\" \",IF(ISBLANK(K37),\" \",ROUND((K37+K$30)/K$28*100,2))))","v":"  "},null,{"$f":"IF(ISBLANK(M$28),\"  \",IF(ISBLANK(M$29),\" \",IF(ISBLANK(M37),\" \",ROUND((M37+M$30)/M$28*100,2))))","v":"  "}]
["Tested By"]
["Remarks"]

{"sheet":"S4","index":3,"n_rows":39,"n_cols":14,"rows_kept":39,"cut":false,"hidden":true,"merged":[[4,0,4,1],[37,2,37,3],[29,12,29,13],[37,12,37,13],[38,0,41,1],[38,2,41,3],[38,4,41,5],[38,6,41,7],[38,8,41,9],[38,10,41,11],[38,12,41,13],[29,4,29,5],[29,6,29,7],[29,8,29,9],[37,10,37,11],[37,4,37,5],[37,6,37,7],[37,8,37,9],[11,0,11,1],[11,2,11,3],[20,8,23,9],[19,0,19,1],[37,0,37,1],[19,4,19,5],[19,6,19,7],[19,8,19,9],[29,0,29,1],[20,10,23,11],[26,8,26,9],[26,10,26,11],[28,0,28,1],[27,0,27,1],[25,0,25,1],[26,0,26,1],[25,10,25,11],[20,0,23,1],[20,2,23,3],[20,4,23,5],[26,4,26,5],[26,6,26,7],[25,4,25,5],[25,6,25,7],[25,8,25,9],[20,12,23,13],[25,12,25,13],[26,12,26,13],[29,2,29,3],[11,10,11,11],[11,12,11,13],[11,4,11,5],[11,6,11,7],[11,8,11,9],[19,12,19,13],[29,10,29,11],[20,6,23,7],[26,2,26,3],[19,2,19,3],[25,2,25,3],[19,10,19,11],[10,0,10,1],[9,0,9,1],[7,10,7,11],[7,12,7,13],[8,0,8,1],[8,2,8,3],[8,4,8,5],[8,6,8,7],[8,8,8,9],[8,10,8,11],[8,12,8,13],[5,3,5,8],[7,0,7,1],[7,2,7,3],[7,4,7,5],[7,6,7,7],[7,8,7,9],[3,10,3,11],[3,12,3,13],[0,0,3,1],[1,10,1,11],[1,12,1,13],[2,10,2,11],[2,12,2,13],[0,8,3,9],[1,2,1,7],[2,2,2,7],[3,2,3,7]]}
[]
[null,null,"COMMONWEALTH OF PENNSYLVANIA",null,null,null,null,null,null,null,"DISTRICT",null,{"$f":"IF(ISBLANK('S1'!L2),\"\",'S1'!L2)","v":""}]
[null,null,"DEPARTMENT OF TRANSPORTATION",null,null,null,null,null,null,null,"PLANT CODE",null,{"$f":"IF(ISBLANK('S1'!L3),\"\",'S1'!L3)","v":""}]
[null,null,"PENNSYLVANIA TURNPIKE COMMISSION",null,null,null,null,null,null,null,"AGG SIZE",null,{"$f":"IF(ISBLANK('S1'!L4),\"\",'S1'!L4)","v":"Type 3B"}]
[{"$f":"'S1'!A5","v":"Aggregate 2023"}]
[null,null,null,{"$f":"'S1'!D6","v":"Material Test Results for Type 3B Anti-Skid"}]
[]
["Sample No."]
["Date"]
["St Wt Before Wash",null,null,"% Loss",null,"% Loss",null,"% Loss",null,"% Loss",null,"% Loss",null,"% Loss"]
["Dry Wt After Wash",null,null,{"$f":"IF(ISBLANK(C10),\" \",IF(ISBLANK(C14),\" \",(C11-C14)/C11*100))","v":" "},null,{"$f":"IF(ISBLANK(E10),\" \",IF(ISBLANK(E14),\" \",(E11-E14)/E11*100))","v":" "},null,{"$f":"IF(ISBLANK(G10),\" \",IF(ISBLANK(G14),\" \",(G11-G14)/G11*100))","v":" "},null,{"$f":"IF(ISBLANK(I10),\" \",IF(ISBLANK(I14),\" \",(I11-I14)/I11*100))","v":" "},null,{"$f":"IF(ISBLANK(K10),\" \",IF(ISBLANK(K14),\" \",(K11-K14)/K11*100))","v":" "},null,{"$f":"IF(ISBLANK(M10),\" \",IF(ISBLANK(M14),\" \",(M11-M14)/M11*100))","v":" "}]
["Wt. Loss",null,{"$f":"IF(ISBLANK(C10),\" \",IF(ISBLANK(C11),\" \",C10-C11))","v":" "},null,{"$f":"IF(ISBLANK(E10),\" \",IF(ISBLANK(E11),\" \",E10-E11))","v":" "},null,{"$f":"IF(ISBLANK(G10),\" \",IF(ISBLANK(G11),\" \",G10-G11))","v":" "},null,{"$f":"IF(ISBLANK(I10),\" \",IF(ISBLANK(I11),\" \",I10-I11))","v":" "},null,{"$f":"IF(ISBLANK(K10),\" \",IF(ISBLANK(K11),\" \",K10-K11))","v":" "},null,{"$f":"IF(ISBLANK(M10),\" \",IF(ISBLANK(M11),\" \",M10-M11))","v":" "}]
["Spec","Sieve","Wt","% Passing","Wt","% Passing","Wt","% Passing","Wt","% Passing","Wt","% Passing","Wt","% Passing"]
[{"$f":"'S1'!A14","v":"100"},0.375,null,{"$f":"IF(ISBLANK(C$10),\"  \",IF(ISBLANK(C$11),\" \",IF(ISBLANK(C14),\" \",ROUND((C14+C$12)/C$10*100,1))))","v":"  "},null,{"$f":"IF(ISBLANK(E$10),\"  \",IF(ISBLANK(E$11),\" \",IF(ISBLANK(E14),\" \",ROUND((E14+E$12)/E$10*100,1))))","v":"  "},null,{"$f":"IF(ISBLANK(G$10),\"  \",IF(ISBLANK(G$11),\" \",IF(ISBLANK(G14),\" \",ROUND((G14+G$12)/G$10*100,1))))","v":"  "},null,{"$f":"IF(ISBLANK(I$10),\"  \",IF(ISBLANK(I$11),\" \",IF(ISBLANK(I14),\" \",ROUND((I14+I$12)/I$10*100,1))))","v":"  "},null,{"$f":"IF(ISBLANK(K$10),\"  \",IF(ISBLANK(K$11),\" \",IF(ISBLANK(K14),\" \",ROUND((K14+K$12)/K$10*100,1))))","v":"  "},null,{"$f":"IF(ISBLANK(M$10),\"  \",IF(ISBLANK(M$11),\" \",IF(ISBLANK(M14),\" \",ROUND((M14+M$12)/M$10*100,1))))","v":"  "}]
[{"$f":"'S1'!A15","v":"Breaker"},0.25,null,{"$f":"IF(ISBLANK(C$10),\"  \",IF(ISBLANK(C$11),\" \",IF(ISBLANK(C15),\" \",ROUND((C15+C$12)/C$10*100,0))))","v":"  "},null,{"$f":"IF(ISBLANK(E$10),\"  \",IF(ISBLANK(E$11),\" \",IF(ISBLANK(E15),\" \",ROUND((E15+E$12)/E$10*100,0))))","v":"  "},null,{"$f":"IF(ISBLANK(G$10),\"  \",IF(ISBLANK(G$11),\" \",IF(ISBLANK(G15),\" \",ROUND((G15+G$12)/G$10*100,0))))","v":"  "},null,{"$f":"IF(ISBLANK(I$10),\"  \",IF(ISBLANK(I$11),\" \",IF(ISBLANK(I15),\" \",ROUND((I15+I$12)/I$10*100,0))))","v":"  "},null,{"$f":"IF(ISBLANK(K$10),\"  \",IF(ISBLANK(K$11),\" \",IF(ISBLANK(K15),\" \",ROUND((K15+K$12)/K$10*100,0))))","v":"  "},null,{"$f":"IF(ISBLANK(M$10),\"  \",IF(ISBLANK(M$11),\" \",IF(ISBLANK(M15),\" \",ROUND((M15+M$12)/M$10*100,0))))","v":"  "}]
[{"$f":"'S1'!A16","v":"85-100"},4,null,{"$f":"IF(ISBLANK(C$10),\"  \",IF(ISBLANK(C$11),\" \",IF(ISBLANK(C16),\" \",ROUND((C16+C$12)/C$10*100,0))))","v":"  "},null,{"$f":"IF(ISBLANK(E$10),\"  \",IF(ISBLANK(E$11),\" \",IF(ISBLANK(E16),\" \",ROUND((E16+E$12)/E$10*100,0))))","v":"  "},null,{"$f":"IF(ISBLANK(G$10),\"  \",IF(ISBLANK(G$11),\" \",IF(ISBLANK(G16),\" \",ROUND((G16+G$12)/G$10*100,0))))","v":"  "},null,{"$f":"IF(ISBLANK(I$10),\"  \",IF(ISBLANK(I$11),\" \",IF(ISBLANK(I16),\" \",ROUND((I16+I$12)/I$10*100,0))))","v":"  "},null,{"$f":"IF(ISBLANK(K$10),\"  \",IF(ISBLANK(K$11),\" \",IF(ISBLANK(K16),\" \",ROUND((K16+K$12)/K$10*100,0))))","v":"  "},null,{"$f":"IF(ISBLANK(M$10),\"  \",IF(ISBLANK(M$11),\" \",IF(ISBLANK(M16),\" \",ROUND((M16+M$12)/M$10*100,0))))","v":"  "}]
[{"$f":"'S1'!A17","v":"0-55"},8,null,{"$f":"IF(ISBLANK(C$10),\"  \",IF(ISBLANK(C$11),\" \",IF(ISBLANK(C17),\" \",ROUND((C17+C$12)/C$10*100,0))))","v":"  "},null,{"$f":"IF(ISBLANK(E$10),\"  \",IF(ISBLANK(E$11),\" \",IF(ISBLANK(E17),\" \",ROUND((E17+E$12)/E$10*100,0))))","v":"  "},null,{"$f":"IF(ISBLANK(G$10),\"  \",IF(ISBLANK(G$11),\" \",IF(ISBLANK(G17),\" \",ROUND((G17+G$12)/G$10*100,0))))","v":"  "},null,{"$f":"IF(ISBLANK(I$10),\"  \",IF(ISBLANK(I$11),\" \",IF(ISBLANK(I17),\" \",ROUND((I17+I$12)/I$10*100,0))))","v":"  "},null,{"$f":"IF(ISBLANK(K$10),\"  \",IF(ISBLANK(K$11),\" \",IF(ISBLANK(K17),\" \",ROUND((K17+K$12)/K$10*100,0))))","v":"  "},null,{"$f":"IF(ISBLANK(M$10),\"  \",IF(ISBLANK(M$11),\" \",IF(ISBLANK(M17),\" \",ROUND((M17+M$12)/M$10*100,0))))","v":"  "}]
[{"$f":"'S1'!A18","v":"0-5"},100,null,{"$f":"IF(ISBLANK(C$10),\"  \",IF(ISBLANK(C$11),\" \",IF(ISBLANK(C18),\" \",ROUND((C18+C$12)/C$10*100,0))))","v":"  "},null,{"$f":"IF(ISBLANK(E$10),\"  \",IF(ISBLANK(E$11),\" \",IF(ISBLANK(E18),\" \",ROUND((E18+E$12)/E$10*100,0))))","v":"  "},null,{"$f":"IF(ISBLANK(G$10),\"  \",IF(ISBLANK(G$11),\" \",IF(ISBLANK(G18),\" \",ROUND((G18+G$12)/G$10*100,0))))","v":"  "},null,{"$f":"IF(ISBLANK(I$10),\"  \",IF(ISBLANK(I$11),\" \",IF(ISBLANK(I18),\" \",ROUND((I18+I$12)/I$10*100,0))))","v":"  "},null,{"$f":"IF(ISBLANK(K$10),\"  \",IF(ISBLANK(K$11),\" \",IF(ISBLANK(K18),\" \",ROUND((K18+K$12)/K$10*100,0))))","v":"  "},null,{"$f":"IF(ISBLANK(M$10),\"  \",IF(ISBLANK(M$11),\" \",IF(ISBLANK(M18),\" \",ROUND((M18+M$12)/M$10*100,0))))","v":"  "}]
[{"$f":"'S1'!A19","v":"0-4"},200,null,{"$f":"IF(ISBLANK(C$10),\"  \",IF(ISBLANK(C$11),\" \",IF(ISBLANK(C19),\" \",ROUND((C19+C$12)/C$10*100,2))))","v":"  "},null,{"$f":"IF(ISBLANK(E$10),\"  \",IF(ISBLANK(E$11),\" \",IF(ISBLANK(E19),\" \",ROUND((E19+E$12)/E$10*100,2))))","v":"  "},null,{"$f":"IF(ISBLANK(G$10),\"  \",IF(ISBLANK(G$11),\" \",IF(ISBLANK(G19),\" \",ROUND((G19+G$12)/G$10*100,2))))","v":"  "},null,{"$f":"IF(ISBLANK(I$10),\"  \",IF(ISBLANK(I$11),\" \",IF(ISBLANK(I19),\" \",ROUND((I19+I$12)/I$10*100,2))))","v":"  "},null,{"$f":"IF(ISBLANK(K$10),\"  \",IF(ISBLANK(K$11),\" \",IF(ISBLANK(K19),\" \",ROUND((K19+K$12)/K$10*100,2))))","v":"  "},null,{"$f":"IF(ISBLANK(M$10),\"  \",IF(ISBLANK(M$11),\" \",IF(ISBLANK(M19),\" \",ROUND((M19+M$12)/M$10*100,2))))","v":"  "}]
["Tested By"]
["Remarks"]
[]
[]
[]
[]
["Sample No."]
["Date"]
["St Wt Before Wash",null,null,"% Loss",null,"% Loss",null,"% Loss",null,"% Loss",null,"% Loss",null,"% Loss"]
["Dry Wt After Wash",null,null,{"$f":"IF(ISBLANK(C28),\" \",IF(ISBLANK(C32),\" \",(C29-C32)/C29*100))","v":" "},null,{"$f":"IF(ISBLANK(E28),\" \",IF(ISBLANK(E32),\" \",(E29-E32)/E29*100))","v":" "},null,{"$f":"IF(ISBLANK(G28),\" \",IF(ISBLANK(G32),\" \",(G29-G32)/G29*100))","v":" "},null,{"$f":"IF(ISBLANK(I28),\" \",IF(ISBLANK(I32),\" \",(I29-I32)/I29*100))","v":" "},null,{"$f":"IF(ISBLANK(K28),\" \",IF(ISBLANK(K32),\" \",(K29-K32)/K29*100))","v":" "},null,{"$f":"IF(ISBLANK(M28),\" \",IF(ISBLANK(M32),\" \",(M29-M32)/M29*100))","v":" "}]
["Wt. Loss",null,{"$f":"IF(ISBLANK(C28),\" \",IF(ISBLANK(C29),\" \",C28-C29))","v":" "},null,{"$f":"IF(ISBLANK(E28),\" \",IF(ISBLANK(E29),\" \",E28-E29))","v":" "},null,{"$f":"IF(ISBLANK(G28),\" \",IF(ISBLANK(G29),\" \",G28-G29))","v":" "},null,{"$f":"IF(ISBLANK(I28),\" \",IF(ISBLANK(I29),\" \",I28-I29))","v":" "},null,{"$f":"IF(ISBLANK(K28),\" \",IF(ISBLANK(K29),\" \",K28-K29))","v":" "},null,{"$f":"IF(ISBLANK(M28),\" \",IF(ISBLANK(M29),\" \",M28-M29))","v":" "}]
["Spec","Sieve","Wt","% Passing","Wt","% Passing","Wt","% Passing","Wt","% Passing","Wt","% Passing","Wt","% Passing"]
[{"$f":"'S1'!A32","v":100},0.375,null,{"$f":"IF(ISBLANK(C$28),\"  \",IF(ISBLANK(C$29),\" \",IF(ISBLANK(C32),\" \",ROUND((C32+C$30)/C$28*100,1))))","v":"  "},null,{"$f":"IF(ISBLANK(E$28),\"  \",IF(ISBLANK(E$29),\" \",IF(ISBLANK(E32),\" \",ROUND((E32+E$30)/E$28*100,1))))","v":"  "},null,{"$f":"IF(ISBLANK(G$28),\"  \",IF(ISBLANK(G$29),\" \",IF(ISBLANK(G32),\" \",ROUND((G32+G$30)/G$28*100,1))))","v":"  "},null,{"$f":"IF(ISBLANK(I$28),\"  \",IF(ISBLANK(I$29),\" \",IF(ISBLANK(I32),\" \",ROUND((I32+I$30)/I$28*100,1))))","v":"  "},null,{"$f":"IF(ISBLANK(K$28),\"  \",IF(ISBLANK(K$29),\" \",IF(ISBLANK(K32),\" \",ROUND((K32+K$30)/K$28*100,1))))","v":"  "},null,{"$f":"IF(ISBLANK(M$28),\"  \",IF(ISBLANK(M$29),\" \",IF(ISBLANK(M32),\" \",ROUND((M32+M$30)/M$28*100,1))))","v":"  "}]
[{"$f":"'S1'!A33","v":"Breaker"},0.25,null,{"$f":"IF(ISBLANK(C$28),\"  \",IF(ISBLANK(C$29),\" \",IF(ISBLANK(C33),\" \",ROUND((C33+C$30)/C$28*100,0))))","v":"  "},null,{"$f":"IF(ISBLANK(E$28),\"  \",IF(ISBLANK(E$29),\" \",IF(ISBLANK(E33),\" \",ROUND((E33+E$30)/E$28*100,0))))","v":"  "},null,{"$f":"IF(ISBLANK(G$28),\"  \",IF(ISBLANK(G$29),\" \",IF(ISBLANK(G33),\" \",ROUND((G33+G$30)/G$28*100,0))))","v":"  "},null,{"$f":"IF(ISBLANK(I$28),\"  \",IF(ISBLANK(I$29),\" \",IF(ISBLANK(I33),\" \",ROUND((I33+I$30)/I$28*100,0))))","v":"  "},null,{"$f":"IF(ISBLANK(K$28),\"  \",IF(ISBLANK(K$29),\" \",IF(ISBLANK(K33),\" \",ROUND((K33+K$30)/K$28*100,0))))","v":"  "},null,{"$f":"IF(ISBLANK(M$28),\"  \",IF(ISBLANK(M$29),\" \",IF(ISBLANK(M33),\" \",ROUND((M33+M$30)/M$28*100,0))))","v":"  "}]
[{"$f":"'S1'!A34","v":"85-100"},4,null,{"$f":"IF(ISBLANK(C$28),\"  \",IF(ISBLANK(C$29),\" \",IF(ISBLANK(C34),\" \",ROUND((C34+C$30)/C$28*100,0))))","v":"  "},null,{"$f":"IF(ISBLANK(E$28),\"  \",IF(ISBLANK(E$29),\" \",IF(ISBLANK(E34),\" \",ROUND((E34+E$30)/E$28*100,0))))","v":"  "},null,{"$f":"IF(ISBLANK(G$28),\"  \",IF(ISBLANK(G$29),\" \",IF(ISBLANK(G34),\" \",ROUND((G34+G$30)/G$28*100,0))))","v":"  "},null,{"$f":"IF(ISBLANK(I$28),\"  \",IF(ISBLANK(I$29),\" \",IF(ISBLANK(I34),\" \",ROUND((I34+I$30)/I$28*100,0))))","v":"  "},null,{"$f":"IF(ISBLANK(K$28),\"  \",IF(ISBLANK(K$29),\" \",IF(ISBLANK(K34),\" \",ROUND((K34+K$30)/K$28*100,0))))","v":"  "},null,{"$f":"IF(ISBLANK(M$28),\"  \",IF(ISBLANK(M$29),\" \",IF(ISBLANK(M34),\" \",ROUND((M34+M$30)/M$28*100,0))))","v":"  "}]
[{"$f":"'S1'!A35","v":"0-55"},8,null,{"$f":"IF(ISBLANK(C$28),\"  \",IF(ISBLANK(C$29),\" \",IF(ISBLANK(C35),\" \",ROUND((C35+C$30)/C$28*100,0))))","v":"  "},null,{"$f":"IF(ISBLANK(E$28),\"  \",IF(ISBLANK(E$29),\" \",IF(ISBLANK(E35),\" \",ROUND((E35+E$30)/E$28*100,0))))","v":"  "},null,{"$f":"IF(ISBLANK(G$28),\"  \",IF(ISBLANK(G$29),\" \",IF(ISBLANK(G35),\" \",ROUND((G35+G$30)/G$28*100,0))))","v":"  "},null,{"$f":"IF(ISBLANK(I$28),\"  \",IF(ISBLANK(I$29),\" \",IF(ISBLANK(I35),\" \",ROUND((I35+I$30)/I$28*100,0))))","v":"  "},null,{"$f":"IF(ISBLANK(K$28),\"  \",IF(ISBLANK(K$29),\" \",IF(ISBLANK(K35),\" \",ROUND((K35+K$30)/K$28*100,0))))","v":"  "},null,{"$f":"IF(ISBLANK(M$28),\"  \",IF(ISBLANK(M$29),\" \",IF(ISBLANK(M35),\" \",ROUND((M35+M$30)/M$28*100,0))))","v":"  "}]
[{"$f":"'S1'!A36","v":"0-5"},100,null,{"$f":"IF(ISBLANK(C$28),\"  \",IF(ISBLANK(C$29),\" \",IF(ISBLANK(C36),\" \",ROUND((C36+C$30)/C$28*100,0))))","v":"  "},null,{"$f":"IF(ISBLANK(E$28),\"  \",IF(ISBLANK(E$29),\" \",IF(ISBLANK(E36),\" \",ROUND((E36+E$30)/E$28*100,0))))","v":"  "},null,{"$f":"IF(ISBLANK(G$28),\"  \",IF(ISBLANK(G$29),\" \",IF(ISBLANK(G36),\" \",ROUND((G36+G$30)/G$28*100,0))))","v":"  "},null,{"$f":"IF(ISBLANK(I$28),\"  \",IF(ISBLANK(I$29),\" \",IF(ISBLANK(I36),\" \",ROUND((I36+I$30)/I$28*100,0))))","v":"  "},null,{"$f":"IF(ISBLANK(K$28),\"  \",IF(ISBLANK(K$29),\" \",IF(ISBLANK(K36),\" \",ROUND((K36+K$30)/K$28*100,0))))","v":"  "},null,{"$f":"IF(ISBLANK(M$28),\"  \",IF(ISBLANK(M$29),\" \",IF(ISBLANK(M36),\" \",ROUND((M36+M$30)/M$28*100,0))))","v":"  "}]
[{"$f":"'S1'!A37","v":"0-4"},200,null,{"$f":"IF(ISBLANK(C$28),\"  \",IF(ISBLANK(C$29),\" \",IF(ISBLANK(C37),\" \",ROUND((C37+C$30)/C$28*100,2))))","v":"  "},null,{"$f":"IF(ISBLANK(E$28),\"  \",IF(ISBLANK(E$29),\" \",IF(ISBLANK(E37),\" \",ROUND((E37+E$30)/E$28*100,2))))","v":"  "},null,{"$f":"IF(ISBLANK(G$28),\"  \",IF(ISBLANK(G$29),\" \",IF(ISBLANK(G37),\" \",ROUND((G37+G$30)/G$28*100,2))))","v":"  "},null,{"$f":"IF(ISBLANK(I$28),\"  \",IF(ISBLANK(I$29),\" \",IF(ISBLANK(I37),\" \",ROUND((I37+I$30)/I$28*100,2))))","v":"  "},null,{"$f":"IF(ISBLANK(K$28),\"  \",IF(ISBLANK(K$29),\" \",IF(ISBLANK(K37),\" \",ROUND((K37+K$30)/K$28*100,2))))","v":"  "},null,{"$f":"IF(ISBLANK(M$28),\"  \",IF(ISBLANK(M$29),\" \",IF(ISBLANK(M37),\" \",ROUND((M37+M$30)/M$28*100,2))))","v":"  "}]
["Tested By"]
["Remarks"]

{"sheet":"S5","index":4,"n_rows":39,"n_cols":14,"rows_kept":39,"cut":false,"hidden":true,"merged":[[4,0,4,1],[37,2,37,3],[29,12,29,13],[37,12,37,13],[38,0,41,1],[38,2,41,3],[38,4,41,5],[38,6,41,7],[38,8,41,9],[38,10,41,11],[38,12,41,13],[29,4,29,5],[29,6,29,7],[29,8,29,9],[37,10,37,11],[37,4,37,5],[37,6,37,7],[37,8,37,9],[11,0,11,1],[11,2,11,3],[20,8,23,9],[19,0,19,1],[37,0,37,1],[19,4,19,5],[19,6,19,7],[19,8,19,9],[29,0,29,1],[20,10,23,11],[26,8,26,9],[26,10,26,11],[28,0,28,1],[27,0,27,1],[25,0,25,1],[26,0,26,1],[25,10,25,11],[20,0,23,1],[20,2,23,3],[20,4,23,5],[26,4,26,5],[26,6,26,7],[25,4,25,5],[25,6,25,7],[25,8,25,9],[20,12,23,13],[25,12,25,13],[26,12,26,13],[29,2,29,3],[11,10,11,11],[11,12,11,13],[11,4,11,5],[11,6,11,7],[11,8,11,9],[19,12,19,13],[29,10,29,11],[20,6,23,7],[26,2,26,3],[19,2,19,3],[25,2,25,3],[19,10,19,11],[10,0,10,1],[9,0,9,1],[7,10,7,11],[7,12,7,13],[8,0,8,1],[8,2,8,3],[8,4,8,5],[8,6,8,7],[8,8,8,9],[8,10,8,11],[8,12,8,13],[5,3,5,8],[7,0,7,1],[7,2,7,3],[7,4,7,5],[7,6,7,7],[7,8,7,9],[3,10,3,11],[3,12,3,13],[0,0,3,1],[1,10,1,11],[1,12,1,13],[2,10,2,11],[2,12,2,13],[0,8,3,9],[1,2,1,7],[2,2,2,7],[3,2,3,7]]}
[]
[null,null,"COMMONWEALTH OF PENNSYLVANIA",null,null,null,null,null,null,null,"DISTRICT",null,{"$f":"IF(ISBLANK('S1'!L2),\"\",'S1'!L2)","v":""}]
[null,null,"DEPARTMENT OF TRANSPORTATION",null,null,null,null,null,null,null,"PLANT CODE",null,{"$f":"IF(ISBLANK('S1'!L3),\"\",'S1'!L3)","v":""}]
[null,null,"PENNSYLVANIA TURNPIKE COMMISSION",null,null,null,null,null,null,null,"AGG SIZE",null,{"$f":"IF(ISBLANK('S1'!L4),\"\",'S1'!L4)","v":"Type 3B"}]
[{"$f":"'S1'!A5","v":"Aggregate 2023"}]
[null,null,null,{"$f":"'S1'!D6","v":"Material Test Results for Type 3B Anti-Skid"}]
[]
["Sample No."]
["Date"]
["St Wt Before Wash",null,null,"% Loss",null,"% Loss",null,"% Loss",null,"% Loss",null,"% Loss",null,"% Loss"]
["Dry Wt After Wash",null,null,{"$f":"IF(ISBLANK(C10),\" \",IF(ISBLANK(C14),\" \",(C11-C14)/C11*100))","v":" "},null,{"$f":"IF(ISBLANK(E10),\" \",IF(ISBLANK(E14),\" \",(E11-E14)/E11*100))","v":" "},null,{"$f":"IF(ISBLANK(G10),\" \",IF(ISBLANK(G14),\" \",(G11-G14)/G11*100))","v":" "},null,{"$f":"IF(ISBLANK(I10),\" \",IF(ISBLANK(I14),\" \",(I11-I14)/I11*100))","v":" "},null,{"$f":"IF(ISBLANK(K10),\" \",IF(ISBLANK(K14),\" \",(K11-K14)/K11*100))","v":" "},null,{"$f":"IF(ISBLANK(M10),\" \",IF(ISBLANK(M14),\" \",(M11-M14)/M11*100))","v":" "}]
["Wt. Loss",null,{"$f":"IF(ISBLANK(C10),\" \",IF(ISBLANK(C11),\" \",C10-C11))","v":" "},null,{"$f":"IF(ISBLANK(E10),\" \",IF(ISBLANK(E11),\" \",E10-E11))","v":" "},null,{"$f":"IF(ISBLANK(G10),\" \",IF(ISBLANK(G11),\" \",G10-G11))","v":" "},null,{"$f":"IF(ISBLANK(I10),\" \",IF(ISBLANK(I11),\" \",I10-I11))","v":" "},null,{"$f":"IF(ISBLANK(K10),\" \",IF(ISBLANK(K11),\" \",K10-K11))","v":" "},null,{"$f":"IF(ISBLANK(M10),\" \",IF(ISBLANK(M11),\" \",M10-M11))","v":" "}]
["Spec","Sieve","Wt","% Passing","Wt","% Passing","Wt","% Passing","Wt","% Passing","Wt","% Passing","Wt","% Passing"]
[{"$f":"'S1'!A14","v":"100"},0.375,null,{"$f":"IF(ISBLANK(C$10),\"  \",IF(ISBLANK(C$11),\" \",IF(ISBLANK(C14),\" \",ROUND((C14+C$12)/C$10*100,1))))","v":"  "},null,{"$f":"IF(ISBLANK(E$10),\"  \",IF(ISBLANK(E$11),\" \",IF(ISBLANK(E14),\" \",ROUND((E14+E$12)/E$10*100,1))))","v":"  "},null,{"$f":"IF(ISBLANK(G$10),\"  \",IF(ISBLANK(G$11),\" \",IF(ISBLANK(G14),\" \",ROUND((G14+G$12)/G$10*100,1))))","v":"  "},null,{"$f":"IF(ISBLANK(I$10),\"  \",IF(ISBLANK(I$11),\" \",IF(ISBLANK(I14),\" \",ROUND((I14+I$12)/I$10*100,1))))","v":"  "},null,{"$f":"IF(ISBLANK(K$10),\"  \",IF(ISBLANK(K$11),\" \",IF(ISBLANK(K14),\" \",ROUND((K14+K$12)/K$10*100,1))))","v":"  "},null,{"$f":"IF(ISBLANK(M$10),\"  \",IF(ISBLANK(M$11),\" \",IF(ISBLANK(M14),\" \",ROUND((M14+M$12)/M$10*100,1))))","v":"  "}]
[{"$f":"'S1'!A15","v":"Breaker"},0.25,null,{"$f":"IF(ISBLANK(C$10),\"  \",IF(ISBLANK(C$11),\" \",IF(ISBLANK(C15),\" \",ROUND((C15+C$12)/C$10*100,0))))","v":"  "},null,{"$f":"IF(ISBLANK(E$10),\"  \",IF(ISBLANK(E$11),\" \",IF(ISBLANK(E15),\" \",ROUND((E15+E$12)/E$10*100,0))))","v":"  "},null,{"$f":"IF(ISBLANK(G$10),\"  \",IF(ISBLANK(G$11),\" \",IF(ISBLANK(G15),\" \",ROUND((G15+G$12)/G$10*100,0))))","v":"  "},null,{"$f":"IF(ISBLANK(I$10),\"  \",IF(ISBLANK(I$11),\" \",IF(ISBLANK(I15),\" \",ROUND((I15+I$12)/I$10*100,0))))","v":"  "},null,{"$f":"IF(ISBLANK(K$10),\"  \",IF(ISBLANK(K$11),\" \",IF(ISBLANK(K15),\" \",ROUND((K15+K$12)/K$10*100,0))))","v":"  "},null,{"$f":"IF(ISBLANK(M$10),\"  \",IF(ISBLANK(M$11),\" \",IF(ISBLANK(M15),\" \",ROUND((M15+M$12)/M$10*100,0))))","v":"  "}]
[{"$f":"'S1'!A16","v":"85-100"},4,null,{"$f":"IF(ISBLANK(C$10),\"  \",IF(ISBLANK(C$11),\" \",IF(ISBLANK(C16),\" \",ROUND((C16+C$12)/C$10*100,0))))","v":"  "},null,{"$f":"IF(ISBLANK(E$10),\"  \",IF(ISBLANK(E$11),\" \",IF(ISBLANK(E16),\" \",ROUND((E16+E$12)/E$10*100,0))))","v":"  "},null,{"$f":"IF(ISBLANK(G$10),\"  \",IF(ISBLANK(G$11),\" \",IF(ISBLANK(G16),\" \",ROUND((G16+G$12)/G$10*100,0))))","v":"  "},null,{"$f":"IF(ISBLANK(I$10),\"  \",IF(ISBLANK(I$11),\" \",IF(ISBLANK(I16),\" \",ROUND((I16+I$12)/I$10*100,0))))","v":"  "},null,{"$f":"IF(ISBLANK(K$10),\"  \",IF(ISBLANK(K$11),\" \",IF(ISBLANK(K16),\" \",ROUND((K16+K$12)/K$10*100,0))))","v":"  "},null,{"$f":"IF(ISBLANK(M$10),\"  \",IF(ISBLANK(M$11),\" \",IF(ISBLANK(M16),\" \",ROUND((M16+M$12)/M$10*100,0))))","v":"  "}]
[{"$f":"'S1'!A17","v":"0-55"},8,null,{"$f":"IF(ISBLANK(C$10),\"  \",IF(ISBLANK(C$11),\" \",IF(ISBLANK(C17),\" \",ROUND((C17+C$12)/C$10*100,0))))","v":"  "},null,{"$f":"IF(ISBLANK(E$10),\"  \",IF(ISBLANK(E$11),\" \",IF(ISBLANK(E17),\" \",ROUND((E17+E$12)/E$10*100,0))))","v":"  "},null,{"$f":"IF(ISBLANK(G$10),\"  \",IF(ISBLANK(G$11),\" \",IF(ISBLANK(G17),\" \",ROUND((G17+G$12)/G$10*100,0))))","v":"  "},null,{"$f":"IF(ISBLANK(I$10),\"  \",IF(ISBLANK(I$11),\" \",IF(ISBLANK(I17),\" \",ROUND((I17+I$12)/I$10*100,0))))","v":"  "},null,{"$f":"IF(ISBLANK(K$10),\"  \",IF(ISBLANK(K$11),\" \",IF(ISBLANK(K17),\" \",ROUND((K17+K$12)/K$10*100,0))))","v":"  "},null,{"$f":"IF(ISBLANK(M$10),\"  \",IF(ISBLANK(M$11),\" \",IF(ISBLANK(M17),\" \",ROUND((M17+M$12)/M$10*100,0))))","v":"  "}]
[{"$f":"'S1'!A18","v":"0-5"},100,null,{"$f":"IF(ISBLANK(C$10),\"  \",IF(ISBLANK(C$11),\" \",IF(ISBLANK(C18),\" \",ROUND((C18+C$12)/C$10*100,0))))","v":"  "},null,{"$f":"IF(ISBLANK(E$10),\"  \",IF(ISBLANK(E$11),\" \",IF(ISBLANK(E18),\" \",ROUND((E18+E$12)/E$10*100,0))))","v":"  "},null,{"$f":"IF(ISBLANK(G$10),\"  \",IF(ISBLANK(G$11),\" \",IF(ISBLANK(G18),\" \",ROUND((G18+G$12)/G$10*100,0))))","v":"  "},null,{"$f":"IF(ISBLANK(I$10),\"  \",IF(ISBLANK(I$11),\" \",IF(ISBLANK(I18),\" \",ROUND((I18+I$12)/I$10*100,0))))","v":"  "},null,{"$f":"IF(ISBLANK(K$10),\"  \",IF(ISBLANK(K$11),\" \",IF(ISBLANK(K18),\" \",ROUND((K18+K$12)/K$10*100,0))))","v":"  "},null,{"$f":"IF(ISBLANK(M$10),\"  \",IF(ISBLANK(M$11),\" \",IF(ISBLANK(M18),\" \",ROUND((M18+M$12)/M$10*100,0))))","v":"  "}]
[{"$f":"'S1'!A19","v":"0-4"},200,null,{"$f":"IF(ISBLANK(C$10),\"  \",IF(ISBLANK(C$11),\" \",IF(ISBLANK(C19),\" \",ROUND((C19+C$12)/C$10*100,2))))","v":"  "},null,{"$f":"IF(ISBLANK(E$10),\"  \",IF(ISBLANK(E$11),\" \",IF(ISBLANK(E19),\" \",ROUND((E19+E$12)/E$10*100,2))))","v":"  "},null,{"$f":"IF(ISBLANK(G$10),\"  \",IF(ISBLANK(G$11),\" \",IF(ISBLANK(G19),\" \",ROUND((G19+G$12)/G$10*100,2))))","v":"  "},null,{"$f":"IF(ISBLANK(I$10),\"  \",IF(ISBLANK(I$11),\" \",IF(ISBLANK(I19),\" \",ROUND((I19+I$12)/I$10*100,2))))","v":"  "},null,{"$f":"IF(ISBLANK(K$10),\"  \",IF(ISBLANK(K$11),\" \",IF(ISBLANK(K19),\" \",ROUND((K19+K$12)/K$10*100,2))))","v":"  "},null,{"$f":"IF(ISBLANK(M$10),\"  \",IF(ISBLANK(M$11),\" \",IF(ISBLANK(M19),\" \",ROUND((M19+M$12)/M$10*100,2))))","v":"  "}]
["Tested By"]
["Remarks"]
[]
[]
[]
[]
["Sample No."]
["Date"]
["St Wt Before Wash",null,null,"% Loss",null,"% Loss",null,"% Loss",null,"% Loss",null,"% Loss",null,"% Loss"]
["Dry Wt After Wash",null,null,{"$f":"IF(ISBLANK(C28),\" \",IF(ISBLANK(C32),\" \",(C29-C32)/C29*100))","v":" "},null,{"$f":"IF(ISBLANK(E28),\" \",IF(ISBLANK(E32),\" \",(E29-E32)/E29*100))","v":" "},null,{"$f":"IF(ISBLANK(G28),\" \",IF(ISBLANK(G32),\" \",(G29-G32)/G29*100))","v":" "},null,{"$f":"IF(ISBLANK(I28),\" \",IF(ISBLANK(I32),\" \",(I29-I32)/I29*100))","v":" "},null,{"$f":"IF(ISBLANK(K28),\" \",IF(ISBLANK(K32),\" \",(K29-K32)/K29*100))","v":" "},null,{"$f":"IF(ISBLANK(M28),\" \",IF(ISBLANK(M32),\" \",(M29-M32)/M29*100))","v":" "}]
["Wt. Loss",null,{"$f":"IF(ISBLANK(C28),\" \",IF(ISBLANK(C29),\" \",C28-C29))","v":" "},null,{"$f":"IF(ISBLANK(E28),\" \",IF(ISBLANK(E29),\" \",E28-E29))","v":" "},null,{"$f":"IF(ISBLANK(G28),\" \",IF(ISBLANK(G29),\" \",G28-G29))","v":" "},null,{"$f":"IF(ISBLANK(I28),\" \",IF(ISBLANK(I29),\" \",I28-I29))","v":" "},null,{"$f":"IF(ISBLANK(K28),\" \",IF(ISBLANK(K29),\" \",K28-K29))","v":" "},null,{"$f":"IF(ISBLANK(M28),\" \",IF(ISBLANK(M29),\" \",M28-M29))","v":" "}]
["Spec","Sieve","Wt","% Passing","Wt","% Passing","Wt","% Passing","Wt","% Passing","Wt","% Passing","Wt","% Passing"]
[{"$f":"'S1'!A32","v":100},0.375,null,{"$f":"IF(ISBLANK(C$28),\"  \",IF(ISBLANK(C$29),\" \",IF(ISBLANK(C32),\" \",ROUND((C32+C$30)/C$28*100,1))))","v":"  "},null,{"$f":"IF(ISBLANK(E$28),\"  \",IF(ISBLANK(E$29),\" \",IF(ISBLANK(E32),\" \",ROUND((E32+E$30)/E$28*100,1))))","v":"  "},null,{"$f":"IF(ISBLANK(G$28),\"  \",IF(ISBLANK(G$29),\" \",IF(ISBLANK(G32),\" \",ROUND((G32+G$30)/G$28*100,1))))","v":"  "},null,{"$f":"IF(ISBLANK(I$28),\"  \",IF(ISBLANK(I$29),\" \",IF(ISBLANK(I32),\" \",ROUND((I32+I$30)/I$28*100,1))))","v":"  "},null,{"$f":"IF(ISBLANK(K$28),\"  \",IF(ISBLANK(K$29),\" \",IF(ISBLANK(K32),\" \",ROUND((K32+K$30)/K$28*100,1))))","v":"  "},null,{"$f":"IF(ISBLANK(M$28),\"  \",IF(ISBLANK(M$29),\" \",IF(ISBLANK(M32),\" \",ROUND((M32+M$30)/M$28*100,1))))","v":"  "}]
[{"$f":"'S1'!A33","v":"Breaker"},0.25,null,{"$f":"IF(ISBLANK(C$28),\"  \",IF(ISBLANK(C$29),\" \",IF(ISBLANK(C33),\" \",ROUND((C33+C$30)/C$28*100,0))))","v":"  "},null,{"$f":"IF(ISBLANK(E$28),\"  \",IF(ISBLANK(E$29),\" \",IF(ISBLANK(E33),\" \",ROUND((E33+E$30)/E$28*100,0))))","v":"  "},null,{"$f":"IF(ISBLANK(G$28),\"  \",IF(ISBLANK(G$29),\" \",IF(ISBLANK(G33),\" \",ROUND((G33+G$30)/G$28*100,0))))","v":"  "},null,{"$f":"IF(ISBLANK(I$28),\"  \",IF(ISBLANK(I$29),\" \",IF(ISBLANK(I33),\" \",ROUND((I33+I$30)/I$28*100,0))))","v":"  "},null,{"$f":"IF(ISBLANK(K$28),\"  \",IF(ISBLANK(K$29),\" \",IF(ISBLANK(K33),\" \",ROUND((K33+K$30)/K$28*100,0))))","v":"  "},null,{"$f":"IF(ISBLANK(M$28),\"  \",IF(ISBLANK(M$29),\" \",IF(ISBLANK(M33),\" \",ROUND((M33+M$30)/M$28*100,0))))","v":"  "}]
[{"$f":"'S1'!A34","v":"85-100"},4,null,{"$f":"IF(ISBLANK(C$28),\"  \",IF(ISBLANK(C$29),\" \",IF(ISBLANK(C34),\" \",ROUND((C34+C$30)/C$28*100,0))))","v":"  "},null,{"$f":"IF(ISBLANK(E$28),\"  \",IF(ISBLANK(E$29),\" \",IF(ISBLANK(E34),\" \",ROUND((E34+E$30)/E$28*100,0))))","v":"  "},null,{"$f":"IF(ISBLANK(G$28),\"  \",IF(ISBLANK(G$29),\" \",IF(ISBLANK(G34),\" \",ROUND((G34+G$30)/G$28*100,0))))","v":"  "},null,{"$f":"IF(ISBLANK(I$28),\"  \",IF(ISBLANK(I$29),\" \",IF(ISBLANK(I34),\" \",ROUND((I34+I$30)/I$28*100,0))))","v":"  "},null,{"$f":"IF(ISBLANK(K$28),\"  \",IF(ISBLANK(K$29),\" \",IF(ISBLANK(K34),\" \",ROUND((K34+K$30)/K$28*100,0))))","v":"  "},null,{"$f":"IF(ISBLANK(M$28),\"  \",IF(ISBLANK(M$29),\" \",IF(ISBLANK(M34),\" \",ROUND((M34+M$30)/M$28*100,0))))","v":"  "}]
[{"$f":"'S1'!A35","v":"0-55"},8,null,{"$f":"IF(ISBLANK(C$28),\"  \",IF(ISBLANK(C$29),\" \",IF(ISBLANK(C35),\" \",ROUND((C35+C$30)/C$28*100,0))))","v":"  "},null,{"$f":"IF(ISBLANK(E$28),\"  \",IF(ISBLANK(E$29),\" \",IF(ISBLANK(E35),\" \",ROUND((E35+E$30)/E$28*100,0))))","v":"  "},null,{"$f":"IF(ISBLANK(G$28),\"  \",IF(ISBLANK(G$29),\" \",IF(ISBLANK(G35),\" \",ROUND((G35+G$30)/G$28*100,0))))","v":"  "},null,{"$f":"IF(ISBLANK(I$28),\"  \",IF(ISBLANK(I$29),\" \",IF(ISBLANK(I35),\" \",ROUND((I35+I$30)/I$28*100,0))))","v":"  "},null,{"$f":"IF(ISBLANK(K$28),\"  \",IF(ISBLANK(K$29),\" \",IF(ISBLANK(K35),\" \",ROUND((K35+K$30)/K$28*100,0))))","v":"  "},null,{"$f":"IF(ISBLANK(M$28),\"  \",IF(ISBLANK(M$29),\" \",IF(ISBLANK(M35),\" \",ROUND((M35+M$30)/M$28*100,0))))","v":"  "}]
[{"$f":"'S1'!A36","v":"0-5"},100,null,{"$f":"IF(ISBLANK(C$28),\"  \",IF(ISBLANK(C$29),\" \",IF(ISBLANK(C36),\" \",ROUND((C36+C$30)/C$28*100,0))))","v":"  "},null,{"$f":"IF(ISBLANK(E$28),\"  \",IF(ISBLANK(E$29),\" \",IF(ISBLANK(E36),\" \",ROUND((E36+E$30)/E$28*100,0))))","v":"  "},null,{"$f":"IF(ISBLANK(G$28),\"  \",IF(ISBLANK(G$29),\" \",IF(ISBLANK(G36),\" \",ROUND((G36+G$30)/G$28*100,0))))","v":"  "},null,{"$f":"IF(ISBLANK(I$28),\"  \",IF(ISBLANK(I$29),\" \",IF(ISBLANK(I36),\" \",ROUND((I36+I$30)/I$28*100,0))))","v":"  "},null,{"$f":"IF(ISBLANK(K$28),\"  \",IF(ISBLANK(K$29),\" \",IF(ISBLANK(K36),\" \",ROUND((K36+K$30)/K$28*100,0))))","v":"  "},null,{"$f":"IF(ISBLANK(M$28),\"  \",IF(ISBLANK(M$29),\" \",IF(ISBLANK(M36),\" \",ROUND((M36+M$30)/M$28*100,0))))","v":"  "}]
[{"$f":"'S1'!A37","v":"0-4"},200,null,{"$f":"IF(ISBLANK(C$28),\"  \",IF(ISBLANK(C$29),\" \",IF(ISBLANK(C37),\" \",ROUND((C37+C$30)/C$28*100,2))))","v":"  "},null,{"$f":"IF(ISBLANK(E$28),\"  \",IF(ISBLANK(E$29),\" \",IF(ISBLANK(E37),\" \",ROUND((E37+E$30)/E$28*100,2))))","v":"  "},null,{"$f":"IF(ISBLANK(G$28),\"  \",IF(ISBLANK(G$29),\" \",IF(ISBLANK(G37),\" \",ROUND((G37+G$30)/G$28*100,2))))","v":"  "},null,{"$f":"IF(ISBLANK(I$28),\"  \",IF(ISBLANK(I$29),\" \",IF(ISBLANK(I37),\" \",ROUND((I37+I$30)/I$28*100,2))))","v":"  "},null,{"$f":"IF(ISBLANK(K$28),\"  \",IF(ISBLANK(K$29),\" \",IF(ISBLANK(K37),\" \",ROUND((K37+K$30)/K$28*100,2))))","v":"  "},null,{"$f":"IF(ISBLANK(M$28),\"  \",IF(ISBLANK(M$29),\" \",IF(ISBLANK(M37),\" \",ROUND((M37+M$30)/M$28*100,2))))","v":"  "}]
["Tested By"]
["Remarks"]

{"sheet":"S6","index":5,"n_rows":39,"n_cols":14,"rows_kept":39,"cut":false,"hidden":true,"merged":[[4,0,4,1],[37,2,37,3],[29,12,29,13],[37,12,37,13],[38,0,41,1],[38,2,41,3],[38,4,41,5],[38,6,41,7],[38,8,41,9],[38,10,41,11],[38,12,41,13],[29,4,29,5],[29,6,29,7],[29,8,29,9],[37,10,37,11],[37,4,37,5],[37,6,37,7],[37,8,37,9],[11,0,11,1],[11,2,11,3],[20,8,23,9],[19,0,19,1],[37,0,37,1],[19,4,19,5],[19,6,19,7],[19,8,19,9],[29,0,29,1],[20,10,23,11],[26,8,26,9],[26,10,26,11],[28,0,28,1],[27,0,27,1],[25,0,25,1],[26,0,26,1],[25,10,25,11],[20,0,23,1],[20,2,23,3],[20,4,23,5],[26,4,26,5],[26,6,26,7],[25,4,25,5],[25,6,25,7],[25,8,25,9],[20,12,23,13],[25,12,25,13],[26,12,26,13],[29,2,29,3],[11,10,11,11],[11,12,11,13],[11,4,11,5],[11,6,11,7],[11,8,11,9],[19,12,19,13],[29,10,29,11],[20,6,23,7],[26,2,26,3],[19,2,19,3],[25,2,25,3],[19,10,19,11],[10,0,10,1],[9,0,9,1],[7,10,7,11],[7,12,7,13],[8,0,8,1],[8,2,8,3],[8,4,8,5],[8,6,8,7],[8,8,8,9],[8,10,8,11],[8,12,8,13],[5,3,5,8],[7,0,7,1],[7,2,7,3],[7,4,7,5],[7,6,7,7],[7,8,7,9],[3,10,3,11],[3,12,3,13],[0,0,3,1],[1,10,1,11],[1,12,1,13],[2,10,2,11],[2,12,2,13],[0,8,3,9],[1,2,1,7],[2,2,2,7],[3,2,3,7]]}
[]
[null,null,"COMMONWEALTH OF PENNSYLVANIA",null,null,null,null,null,null,null,"DISTRICT",null,{"$f":"IF(ISBLANK('S1'!L2),\"\",'S1'!L2)","v":""}]
[null,null,"DEPARTMENT OF TRANSPORTATION",null,null,null,null,null,null,null,"PLANT CODE",null,{"$f":"IF(ISBLANK('S1'!L3),\"\",'S1'!L3)","v":""}]
[null,null,"PENNSYLVANIA TURNPIKE COMMISSION",null,null,null,null,null,null,null,"AGG SIZE",null,{"$f":"IF(ISBLANK('S1'!L4),\"\",'S1'!L4)","v":"Type 3B"}]
[{"$f":"'S1'!A5","v":"Aggregate 2023"}]
[null,null,null,{"$f":"'S1'!D6","v":"Material Test Results for Type 3B Anti-Skid"}]
[]
["Sample No."]
["Date"]
["St Wt Before Wash",null,null,"% Loss",null,"% Loss",null,"% Loss",null,"% Loss",null,"% Loss",null,"% Loss"]
["Dry Wt After Wash",null,null,{"$f":"IF(ISBLANK(C10),\" \",IF(ISBLANK(C14),\" \",(C11-C14)/C11*100))","v":" "},null,{"$f":"IF(ISBLANK(E10),\" \",IF(ISBLANK(E14),\" \",(E11-E14)/E11*100))","v":" "},null,{"$f":"IF(ISBLANK(G10),\" \",IF(ISBLANK(G14),\" \",(G11-G14)/G11*100))","v":" "},null,{"$f":"IF(ISBLANK(I10),\" \",IF(ISBLANK(I14),\" \",(I11-I14)/I11*100))","v":" "},null,{"$f":"IF(ISBLANK(K10),\" \",IF(ISBLANK(K14),\" \",(K11-K14)/K11*100))","v":" "},null,{"$f":"IF(ISBLANK(M10),\" \",IF(ISBLANK(M14),\" \",(M11-M14)/M11*100))","v":" "}]
["Wt. Loss",null,{"$f":"IF(ISBLANK(C10),\" \",IF(ISBLANK(C11),\" \",C10-C11))","v":" "},null,{"$f":"IF(ISBLANK(E10),\" \",IF(ISBLANK(E11),\" \",E10-E11))","v":" "},null,{"$f":"IF(ISBLANK(G10),\" \",IF(ISBLANK(G11),\" \",G10-G11))","v":" "},null,{"$f":"IF(ISBLANK(I10),\" \",IF(ISBLANK(I11),\" \",I10-I11))","v":" "},null,{"$f":"IF(ISBLANK(K10),\" \",IF(ISBLANK(K11),\" \",K10-K11))","v":" "},null,{"$f":"IF(ISBLANK(M10),\" \",IF(ISBLANK(M11),\" \",M10-M11))","v":" "}]
["Spec","Sieve","Wt","% Passing","Wt","% Passing","Wt","% Passing","Wt","% Passing","Wt","% Passing","Wt","% Passing"]
[{"$f":"'S1'!A14","v":"100"},0.375,null,{"$f":"IF(ISBLANK(C$10),\"  \",IF(ISBLANK(C$11),\" \",IF(ISBLANK(C14),\" \",ROUND((C14+C$12)/C$10*100,1))))","v":"  "},null,{"$f":"IF(ISBLANK(E$10),\"  \",IF(ISBLANK(E$11),\" \",IF(ISBLANK(E14),\" \",ROUND((E14+E$12)/E$10*100,1))))","v":"  "},null,{"$f":"IF(ISBLANK(G$10),\"  \",IF(ISBLANK(G$11),\" \",IF(ISBLANK(G14),\" \",ROUND((G14+G$12)/G$10*100,1))))","v":"  "},null,{"$f":"IF(ISBLANK(I$10),\"  \",IF(ISBLANK(I$11),\" \",IF(ISBLANK(I14),\" \",ROUND((I14+I$12)/I$10*100,1))))","v":"  "},null,{"$f":"IF(ISBLANK(K$10),\"  \",IF(ISBLANK(K$11),\" \",IF(ISBLANK(K14),\" \",ROUND((K14+K$12)/K$10*100,1))))","v":"  "},null,{"$f":"IF(ISBLANK(M$10),\"  \",IF(ISBLANK(M$11),\" \",IF(ISBLANK(M14),\" \",ROUND((M14+M$12)/M$10*100,1))))","v":"  "}]
[{"$f":"'S1'!A15","v":"Breaker"},0.25,null,{"$f":"IF(ISBLANK(C$10),\"  \",IF(ISBLANK(C$11),\" \",IF(ISBLANK(C15),\" \",ROUND((C15+C$12)/C$10*100,0))))","v":"  "},null,{"$f":"IF(ISBLANK(E$10),\"  \",IF(ISBLANK(E$11),\" \",IF(ISBLANK(E15),\" \",ROUND((E15+E$12)/E$10*100,0))))","v":"  "},null,{"$f":"IF(ISBLANK(G$10),\"  \",IF(ISBLANK(G$11),\" \",IF(ISBLANK(G15),\" \",ROUND((G15+G$12)/G$10*100,0))))","v":"  "},null,{"$f":"IF(ISBLANK(I$10),\"  \",IF(ISBLANK(I$11),\" \",IF(ISBLANK(I15),\" \",ROUND((I15+I$12)/I$10*100,0))))","v":"  "},null,{"$f":"IF(ISBLANK(K$10),\"  \",IF(ISBLANK(K$11),\" \",IF(ISBLANK(K15),\" \",ROUND((K15+K$12)/K$10*100,0))))","v":"  "},null,{"$f":"IF(ISBLANK(M$10),\"  \",IF(ISBLANK(M$11),\" \",IF(ISBLANK(M15),\" \",ROUND((M15+M$12)/M$10*100,0))))","v":"  "}]
[{"$f":"'S1'!A16","v":"85-100"},4,null,{"$f":"IF(ISBLANK(C$10),\"  \",IF(ISBLANK(C$11),\" \",IF(ISBLANK(C16),\" \",ROUND((C16+C$12)/C$10*100,0))))","v":"  "},null,{"$f":"IF(ISBLANK(E$10),\"  \",IF(ISBLANK(E$11),\" \",IF(ISBLANK(E16),\" \",ROUND((E16+E$12)/E$10*100,0))))","v":"  "},null,{"$f":"IF(ISBLANK(G$10),\"  \",IF(ISBLANK(G$11),\" \",IF(ISBLANK(G16),\" \",ROUND((G16+G$12)/G$10*100,0))))","v":"  "},null,{"$f":"IF(ISBLANK(I$10),\"  \",IF(ISBLANK(I$11),\" \",IF(ISBLANK(I16),\" \",ROUND((I16+I$12)/I$10*100,0))))","v":"  "},null,{"$f":"IF(ISBLANK(K$10),\"  \",IF(ISBLANK(K$11),\" \",IF(ISBLANK(K16),\" \",ROUND((K16+K$12)/K$10*100,0))))","v":"  "},null,{"$f":"IF(ISBLANK(M$10),\"  \",IF(ISBLANK(M$11),\" \",IF(ISBLANK(M16),\" \",ROUND((M16+M$12)/M$10*100,0))))","v":"  "}]
[{"$f":"'S1'!A17","v":"0-55"},8,null,{"$f":"IF(ISBLANK(C$10),\"  \",IF(ISBLANK(C$11),\" \",IF(ISBLANK(C17),\" \",ROUND((C17+C$12)/C$10*100,0))))","v":"  "},null,{"$f":"IF(ISBLANK(E$10),\"  \",IF(ISBLANK(E$11),\" \",IF(ISBLANK(E17),\" \",ROUND((E17+E$12)/E$10*100,0))))","v":"  "},null,{"$f":"IF(ISBLANK(G$10),\"  \",IF(ISBLANK(G$11),\" \",IF(ISBLANK(G17),\" \",ROUND((G17+G$12)/G$10*100,0))))","v":"  "},null,{"$f":"IF(ISBLANK(I$10),\"  \",IF(ISBLANK(I$11),\" \",IF(ISBLANK(I17),\" \",ROUND((I17+I$12)/I$10*100,0))))","v":"  "},null,{"$f":"IF(ISBLANK(K$10),\"  \",IF(ISBLANK(K$11),\" \",IF(ISBLANK(K17),\" \",ROUND((K17+K$12)/K$10*100,0))))","v":"  "},null,{"$f":"IF(ISBLANK(M$10),\"  \",IF(ISBLANK(M$11),\" \",IF(ISBLANK(M17),\" \",ROUND((M17+M$12)/M$10*100,0))))","v":"  "}]
[{"$f":"'S1'!A18","v":"0-5"},100,null,{"$f":"IF(ISBLANK(C$10),\"  \",IF(ISBLANK(C$11),\" \",IF(ISBLANK(C18),\" \",ROUND((C18+C$12)/C$10*100,0))))","v":"  "},null,{"$f":"IF(ISBLANK(E$10),\"  \",IF(ISBLANK(E$11),\" \",IF(ISBLANK(E18),\" \",ROUND((E18+E$12)/E$10*100,0))))","v":"  "},null,{"$f":"IF(ISBLANK(G$10),\"  \",IF(ISBLANK(G$11),\" \",IF(ISBLANK(G18),\" \",ROUND((G18+G$12)/G$10*100,0))))","v":"  "},null,{"$f":"IF(ISBLANK(I$10),\"  \",IF(ISBLANK(I$11),\" \",IF(ISBLANK(I18),\" \",ROUND((I18+I$12)/I$10*100,0))))","v":"  "},null,{"$f":"IF(ISBLANK(K$10),\"  \",IF(ISBLANK(K$11),\" \",IF(ISBLANK(K18),\" \",ROUND((K18+K$12)/K$10*100,0))))","v":"  "},null,{"$f":"IF(ISBLANK(M$10),\"  \",IF(ISBLANK(M$11),\" \",IF(ISBLANK(M18),\" \",ROUND((M18+M$12)/M$10*100,0))))","v":"  "}]
[{"$f":"'S1'!A19","v":"0-4"},200,null,{"$f":"IF(ISBLANK(C$10),\"  \",IF(ISBLANK(C$11),\" \",IF(ISBLANK(C19),\" \",ROUND((C19+C$12)/C$10*100,2))))","v":"  "},null,{"$f":"IF(ISBLANK(E$10),\"  \",IF(ISBLANK(E$11),\" \",IF(ISBLANK(E19),\" \",ROUND((E19+E$12)/E$10*100,2))))","v":"  "},null,{"$f":"IF(ISBLANK(G$10),\"  \",IF(ISBLANK(G$11),\" \",IF(ISBLANK(G19),\" \",ROUND((G19+G$12)/G$10*100,2))))","v":"  "},null,{"$f":"IF(ISBLANK(I$10),\"  \",IF(ISBLANK(I$11),\" \",IF(ISBLANK(I19),\" \",ROUND((I19+I$12)/I$10*100,2))))","v":"  "},null,{"$f":"IF(ISBLANK(K$10),\"  \",IF(ISBLANK(K$11),\" \",IF(ISBLANK(K19),\" \",ROUND((K19+K$12)/K$10*100,2))))","v":"  "},null,{"$f":"IF(ISBLANK(M$10),\"  \",IF(ISBLANK(M$11),\" \",IF(ISBLANK(M19),\" \",ROUND((M19+M$12)/M$10*100,2))))","v":"  "}]
["Tested By"]
["Remarks"]
[]
[]
[]
[]
["Sample No."]
["Date"]
["St Wt Before Wash",null,null,"% Loss",null,"% Loss",null,"% Loss",null,"% Loss",null,"% Loss",null,"% Loss"]
["Dry Wt After Wash",null,null,{"$f":"IF(ISBLANK(C28),\" \",IF(ISBLANK(C32),\" \",(C29-C32)/C29*100))","v":" "},null,{"$f":"IF(ISBLANK(E28),\" \",IF(ISBLANK(E32),\" \",(E29-E32)/E29*100))","v":" "},null,{"$f":"IF(ISBLANK(G28),\" \",IF(ISBLANK(G32),\" \",(G29-G32)/G29*100))","v":" "},null,{"$f":"IF(ISBLANK(I28),\" \",IF(ISBLANK(I32),\" \",(I29-I32)/I29*100))","v":" "},null,{"$f":"IF(ISBLANK(K28),\" \",IF(ISBLANK(K32),\" \",(K29-K32)/K29*100))","v":" "},null,{"$f":"IF(ISBLANK(M28),\" \",IF(ISBLANK(M32),\" \",(M29-M32)/M29*100))","v":" "}]
["Wt. Loss",null,{"$f":"IF(ISBLANK(C28),\" \",IF(ISBLANK(C29),\" \",C28-C29))","v":" "},null,{"$f":"IF(ISBLANK(E28),\" \",IF(ISBLANK(E29),\" \",E28-E29))","v":" "},null,{"$f":"IF(ISBLANK(G28),\" \",IF(ISBLANK(G29),\" \",G28-G29))","v":" "},null,{"$f":"IF(ISBLANK(I28),\" \",IF(ISBLANK(I29),\" \",I28-I29))","v":" "},null,{"$f":"IF(ISBLANK(K28),\" \",IF(ISBLANK(K29),\" \",K28-K29))","v":" "},null,{"$f":"IF(ISBLANK(M28),\" \",IF(ISBLANK(M29),\" \",M28-M29))","v":" "}]
["Spec","Sieve","Wt","% Passing","Wt","% Passing","Wt","% Passing","Wt","% Passing","Wt","% Passing","Wt","% Passing"]
[{"$f":"'S1'!A32","v":100},0.375,null,{"$f":"IF(ISBLANK(C$28),\"  \",IF(ISBLANK(C$29),\" \",IF(ISBLANK(C32),\" \",ROUND((C32+C$30)/C$28*100,1))))","v":"  "},null,{"$f":"IF(ISBLANK(E$28),\"  \",IF(ISBLANK(E$29),\" \",IF(ISBLANK(E32),\" \",ROUND((E32+E$30)/E$28*100,1))))","v":"  "},null,{"$f":"IF(ISBLANK(G$28),\"  \",IF(ISBLANK(G$29),\" \",IF(ISBLANK(G32),\" \",ROUND((G32+G$30)/G$28*100,1))))","v":"  "},null,{"$f":"IF(ISBLANK(I$28),\"  \",IF(ISBLANK(I$29),\" \",IF(ISBLANK(I32),\" \",ROUND((I32+I$30)/I$28*100,1))))","v":"  "},null,{"$f":"IF(ISBLANK(K$28),\"  \",IF(ISBLANK(K$29),\" \",IF(ISBLANK(K32),\" \",ROUND((K32+K$30)/K$28*100,1))))","v":"  "},null,{"$f":"IF(ISBLANK(M$28),\"  \",IF(ISBLANK(M$29),\" \",IF(ISBLANK(M32),\" \",ROUND((M32+M$30)/M$28*100,1))))","v":"  "}]
[{"$f":"'S1'!A33","v":"Breaker"},0.25,null,{"$f":"IF(ISBLANK(C$28),\"  \",IF(ISBLANK(C$29),\" \",IF(ISBLANK(C33),\" \",ROUND((C33+C$30)/C$28*100,0))))","v":"  "},null,{"$f":"IF(ISBLANK(E$28),\"  \",IF(ISBLANK(E$29),\" \",IF(ISBLANK(E33),\" \",ROUND((E33+E$30)/E$28*100,0))))","v":"  "},null,{"$f":"IF(ISBLANK(G$28),\"  \",IF(ISBLANK(G$29),\" \",IF(ISBLANK(G33),\" \",ROUND((G33+G$30)/G$28*100,0))))","v":"  "},null,{"$f":"IF(ISBLANK(I$28),\"  \",IF(ISBLANK(I$29),\" \",IF(ISBLANK(I33),\" \",ROUND((I33+I$30)/I$28*100,0))))","v":"  "},null,{"$f":"IF(ISBLANK(K$28),\"  \",IF(ISBLANK(K$29),\" \",IF(ISBLANK(K33),\" \",ROUND((K33+K$30)/K$28*100,0))))","v":"  "},null,{"$f":"IF(ISBLANK(M$28),\"  \",IF(ISBLANK(M$29),\" \",IF(ISBLANK(M33),\" \",ROUND((M33+M$30)/M$28*100,0))))","v":"  "}]
[{"$f":"'S1'!A34","v":"85-100"},4,null,{"$f":"IF(ISBLANK(C$28),\"  \",IF(ISBLANK(C$29),\" \",IF(ISBLANK(C34),\" \",ROUND((C34+C$30)/C$28*100,0))))","v":"  "},null,{"$f":"IF(ISBLANK(E$28),\"  \",IF(ISBLANK(E$29),\" \",IF(ISBLANK(E34),\" \",ROUND((E34+E$30)/E$28*100,0))))","v":"  "},null,{"$f":"IF(ISBLANK(G$28),\"  \",IF(ISBLANK(G$29),\" \",IF(ISBLANK(G34),\" \",ROUND((G34+G$30)/G$28*100,0))))","v":"  "},null,{"$f":"IF(ISBLANK(I$28),\"  \",IF(ISBLANK(I$29),\" \",IF(ISBLANK(I34),\" \",ROUND((I34+I$30)/I$28*100,0))))","v":"  "},null,{"$f":"IF(ISBLANK(K$28),\"  \",IF(ISBLANK(K$29),\" \",IF(ISBLANK(K34),\" \",ROUND((K34+K$30)/K$28*100,0))))","v":"  "},null,{"$f":"IF(ISBLANK(M$28),\"  \",IF(ISBLANK(M$29),\" \",IF(ISBLANK(M34),\" \",ROUND((M34+M$30)/M$28*100,0))))","v":"  "}]
[{"$f":"'S1'!A35","v":"0-55"},8,null,{"$f":"IF(ISBLANK(C$28),\"  \",IF(ISBLANK(C$29),\" \",IF(ISBLANK(C35),\" \",ROUND((C35+C$30)/C$28*100,0))))","v":"  "},null,{"$f":"IF(ISBLANK(E$28),\"  \",IF(ISBLANK(E$29),\" \",IF(ISBLANK(E35),\" \",ROUND((E35+E$30)/E$28*100,0))))","v":"  "},null,{"$f":"IF(ISBLANK(G$28),\"  \",IF(ISBLANK(G$29),\" \",IF(ISBLANK(G35),\" \",ROUND((G35+G$30)/G$28*100,0))))","v":"  "},null,{"$f":"IF(ISBLANK(I$28),\"  \",IF(ISBLANK(I$29),\" \",IF(ISBLANK(I35),\" \",ROUND((I35+I$30)/I$28*100,0))))","v":"  "},null,{"$f":"IF(ISBLANK(K$28),\"  \",IF(ISBLANK(K$29),\" \",IF(ISBLANK(K35),\" \",ROUND((K35+K$30)/K$28*100,0))))","v":"  "},null,{"$f":"IF(ISBLANK(M$28),\"  \",IF(ISBLANK(M$29),\" \",IF(ISBLANK(M35),\" \",ROUND((M35+M$30)/M$28*100,0))))","v":"  "}]
[{"$f":"'S1'!A36","v":"0-5"},100,null,{"$f":"IF(ISBLANK(C$28),\"  \",IF(ISBLANK(C$29),\" \",IF(ISBLANK(C36),\" \",ROUND((C36+C$30)/C$28*100,0))))","v":"  "},null,{"$f":"IF(ISBLANK(E$28),\"  \",IF(ISBLANK(E$29),\" \",IF(ISBLANK(E36),\" \",ROUND((E36+E$30)/E$28*100,0))))","v":"  "},null,{"$f":"IF(ISBLANK(G$28),\"  \",IF(ISBLANK(G$29),\" \",IF(ISBLANK(G36),\" \",ROUND((G36+G$30)/G$28*100,0))))","v":"  "},null,{"$f":"IF(ISBLANK(I$28),\"  \",IF(ISBLANK(I$29),\" \",IF(ISBLANK(I36),\" \",ROUND((I36+I$30)/I$28*100,0))))","v":"  "},null,{"$f":"IF(ISBLANK(K$28),\"  \",IF(ISBLANK(K$29),\" \",IF(ISBLANK(K36),\" \",ROUND((K36+K$30)/K$28*100,0))))","v":"  "},null,{"$f":"IF(ISBLANK(M$28),\"  \",IF(ISBLANK(M$29),\" \",IF(ISBLANK(M36),\" \",ROUND((M36+M$30)/M$28*100,0))))","v":"  "}]
[{"$f":"'S1'!A37","v":"0-4"},200,null,{"$f":"IF(ISBLANK(C$28),\"  \",IF(ISBLANK(C$29),\" \",IF(ISBLANK(C37),\" \",ROUND((C37+C$30)/C$28*100,2))))","v":"  "},null,{"$f":"IF(ISBLANK(E$28),\"  \",IF(ISBLANK(E$29),\" \",IF(ISBLANK(E37),\" \",ROUND((E37+E$30)/E$28*100,2))))","v":"  "},null,{"$f":"IF(ISBLANK(G$28),\"  \",IF(ISBLANK(G$29),\" \",IF(ISBLANK(G37),\" \",ROUND((G37+G$30)/G$28*100,2))))","v":"  "},null,{"$f":"IF(ISBLANK(I$28),\"  \",IF(ISBLANK(I$29),\" \",IF(ISBLANK(I37),\" \",ROUND((I37+I$30)/I$28*100,2))))","v":"  "},null,{"$f":"IF(ISBLANK(K$28),\"  \",IF(ISBLANK(K$29),\" \",IF(ISBLANK(K37),\" \",ROUND((K37+K$30)/K$28*100,2))))","v":"  "},null,{"$f":"IF(ISBLANK(M$28),\"  \",IF(ISBLANK(M$29),\" \",IF(ISBLANK(M37),\" \",ROUND((M37+M$30)/M$28*100,2))))","v":"  "}]
["Tested By"]
["Remarks"]

{"sheet":"S7","index":6,"n_rows":39,"n_cols":14,"rows_kept":39,"cut":false,"hidden":true,"merged":[[4,0,4,1],[37,2,37,3],[29,12,29,13],[37,12,37,13],[38,0,41,1],[38,2,41,3],[38,4,41,5],[38,6,41,7],[38,8,41,9],[38,10,41,11],[38,12,41,13],[29,4,29,5],[29,6,29,7],[29,8,29,9],[37,10,37,11],[37,4,37,5],[37,6,37,7],[37,8,37,9],[11,0,11,1],[11,2,11,3],[20,8,23,9],[19,0,19,1],[37,0,37,1],[19,4,19,5],[19,6,19,7],[19,8,19,9],[29,0,29,1],[20,10,23,11],[26,8,26,9],[26,10,26,11],[28,0,28,1],[27,0,27,1],[25,0,25,1],[26,0,26,1],[25,10,25,11],[20,0,23,1],[20,2,23,3],[20,4,23,5],[26,4,26,5],[26,6,26,7],[25,4,25,5],[25,6,25,7],[25,8,25,9],[20,12,23,13],[25,12,25,13],[26,12,26,13],[29,2,29,3],[11,10,11,11],[11,12,11,13],[11,4,11,5],[11,6,11,7],[11,8,11,9],[19,12,19,13],[29,10,29,11],[20,6,23,7],[26,2,26,3],[19,2,19,3],[25,2,25,3],[19,10,19,11],[10,0,10,1],[9,0,9,1],[7,10,7,11],[7,12,7,13],[8,0,8,1],[8,2,8,3],[8,4,8,5],[8,6,8,7],[8,8,8,9],[8,10,8,11],[8,12,8,13],[5,3,5,8],[7,0,7,1],[7,2,7,3],[7,4,7,5],[7,6,7,7],[7,8,7,9],[3,10,3,11],[3,12,3,13],[0,0,3,1],[1,10,1,11],[1,12,1,13],[2,10,2,11],[2,12,2,13],[0,8,3,9],[1,2,1,7],[2,2,2,7],[3,2,3,7]]}
[]
[null,null,"COMMONWEALTH OF PENNSYLVANIA",null,null,null,null,null,null,null,"DISTRICT",null,{"$f":"IF(ISBLANK('S1'!L2),\"\",'S1'!L2)","v":""}]
[null,null,"DEPARTMENT OF TRANSPORTATION",null,null,null,null,null,null,null,"PLANT CODE",null,{"$f":"IF(ISBLANK('S1'!L3),\"\",'S1'!L3)","v":""}]
[null,null,"PENNSYLVANIA TURNPIKE COMMISSION",null,null,null,null,null,null,null,"AGG SIZE",null,{"$f":"IF(ISBLANK('S1'!L4),\"\",'S1'!L4)","v":"Type 3B"}]
[{"$f":"'S1'!A5","v":"Aggregate 2023"}]
[null,null,null,{"$f":"'S1'!D6","v":"Material Test Results for Type 3B Anti-Skid"}]
[]
["Sample No."]
["Date"]
["St Wt Before Wash",null,null,"% Loss",null,"% Loss",null,"% Loss",null,"% Loss",null,"% Loss",null,"% Loss"]
["Dry Wt After Wash",null,null,{"$f":"IF(ISBLANK(C10),\" \",IF(ISBLANK(C14),\" \",(C11-C14)/C11*100))","v":" "},null,{"$f":"IF(ISBLANK(E10),\" \",IF(ISBLANK(E14),\" \",(E11-E14)/E11*100))","v":" "},null,{"$f":"IF(ISBLANK(G10),\" \",IF(ISBLANK(G14),\" \",(G11-G14)/G11*100))","v":" "},null,{"$f":"IF(ISBLANK(I10),\" \",IF(ISBLANK(I14),\" \",(I11-I14)/I11*100))","v":" "},null,{"$f":"IF(ISBLANK(K10),\" \",IF(ISBLANK(K14),\" \",(K11-K14)/K11*100))","v":" "},null,{"$f":"IF(ISBLANK(M10),\" \",IF(ISBLANK(M14),\" \",(M11-M14)/M11*100))","v":" "}]
["Wt. Loss",null,{"$f":"IF(ISBLANK(C10),\" \",IF(ISBLANK(C11),\" \",C10-C11))","v":" "},null,{"$f":"IF(ISBLANK(E10),\" \",IF(ISBLANK(E11),\" \",E10-E11))","v":" "},null,{"$f":"IF(ISBLANK(G10),\" \",IF(ISBLANK(G11),\" \",G10-G11))","v":" "},null,{"$f":"IF(ISBLANK(I10),\" \",IF(ISBLANK(I11),\" \",I10-I11))","v":" "},null,{"$f":"IF(ISBLANK(K10),\" \",IF(ISBLANK(K11),\" \",K10-K11))","v":" "},null,{"$f":"IF(ISBLANK(M10),\" \",IF(ISBLANK(M11),\" \",M10-M11))","v":" "}]
["Spec","Sieve","Wt","% Passing","Wt","% Passing","Wt","% Passing","Wt","% Passing","Wt","% Passing","Wt","% Passing"]
[{"$f":"'S1'!A14","v":"100"},0.375,null,{"$f":"IF(ISBLANK(C$10),\"  \",IF(ISBLANK(C$11),\" \",IF(ISBLANK(C14),\" \",ROUND((C14+C$12)/C$10*100,1))))","v":"  "},null,{"$f":"IF(ISBLANK(E$10),\"  \",IF(ISBLANK(E$11),\" \",IF(ISBLANK(E14),\" \",ROUND((E14+E$12)/E$10*100,1))))","v":"  "},null,{"$f":"IF(ISBLANK(G$10),\"  \",IF(ISBLANK(G$11),\" \",IF(ISBLANK(G14),\" \",ROUND((G14+G$12)/G$10*100,1))))","v":"  "},null,{"$f":"IF(ISBLANK(I$10),\"  \",IF(ISBLANK(I$11),\" \",IF(ISBLANK(I14),\" \",ROUND((I14+I$12)/I$10*100,1))))","v":"  "},null,{"$f":"IF(ISBLANK(K$10),\"  \",IF(ISBLANK(K$11),\" \",IF(ISBLANK(K14),\" \",ROUND((K14+K$12)/K$10*100,1))))","v":"  "},null,{"$f":"IF(ISBLANK(M$10),\"  \",IF(ISBLANK(M$11),\" \",IF(ISBLANK(M14),\" \",ROUND((M14+M$12)/M$10*100,1))))","v":"  "}]
[{"$f":"'S1'!A15","v":"Breaker"},0.25,null,{"$f":"IF(ISBLANK(C$10),\"  \",IF(ISBLANK(C$11),\" \",IF(ISBLANK(C15),\" \",ROUND((C15+C$12)/C$10*100,0))))","v":"  "},null,{"$f":"IF(ISBLANK(E$10),\"  \",IF(ISBLANK(E$11),\" \",IF(ISBLANK(E15),\" \",ROUND((E15+E$12)/E$10*100,0))))","v":"  "},null,{"$f":"IF(ISBLANK(G$10),\"  \",IF(ISBLANK(G$11),\" \",IF(ISBLANK(G15),\" \",ROUND((G15+G$12)/G$10*100,0))))","v":"  "},null,{"$f":"IF(ISBLANK(I$10),\"  \",IF(ISBLANK(I$11),\" \",IF(ISBLANK(I15),\" \",ROUND((I15+I$12)/I$10*100,0))))","v":"  "},null,{"$f":"IF(ISBLANK(K$10),\"  \",IF(ISBLANK(K$11),\" \",IF(ISBLANK(K15),\" \",ROUND((K15+K$12)/K$10*100,0))))","v":"  "},null,{"$f":"IF(ISBLANK(M$10),\"  \",IF(ISBLANK(M$11),\" \",IF(ISBLANK(M15),\" \",ROUND((M15+M$12)/M$10*100,0))))","v":"  "}]
[{"$f":"'S1'!A16","v":"85-100"},4,null,{"$f":"IF(ISBLANK(C$10),\"  \",IF(ISBLANK(C$11),\" \",IF(ISBLANK(C16),\" \",ROUND((C16+C$12)/C$10*100,0))))","v":"  "},null,{"$f":"IF(ISBLANK(E$10),\"  \",IF(ISBLANK(E$11),\" \",IF(ISBLANK(E16),\" \",ROUND((E16+E$12)/E$10*100,0))))","v":"  "},null,{"$f":"IF(ISBLANK(G$10),\"  \",IF(ISBLANK(G$11),\" \",IF(ISBLANK(G16),\" \",ROUND((G16+G$12)/G$10*100,0))))","v":"  "},null,{"$f":"IF(ISBLANK(I$10),\"  \",IF(ISBLANK(I$11),\" \",IF(ISBLANK(I16),\" \",ROUND((I16+I$12)/I$10*100,0))))","v":"  "},null,{"$f":"IF(ISBLANK(K$10),\"  \",IF(ISBLANK(K$11),\" \",IF(ISBLANK(K16),\" \",ROUND((K16+K$12)/K$10*100,0))))","v":"  "},null,{"$f":"IF(ISBLANK(M$10),\"  \",IF(ISBLANK(M$11),\" \",IF(ISBLANK(M16),\" \",ROUND((M16+M$12)/M$10*100,0))))","v":"  "}]
[{"$f":"'S1'!A17","v":"0-55"},8,null,{"$f":"IF(ISBLANK(C$10),\"  \",IF(ISBLANK(C$11),\" \",IF(ISBLANK(C17),\" \",ROUND((C17+C$12)/C$10*100,0))))","v":"  "},null,{"$f":"IF(ISBLANK(E$10),\"  \",IF(ISBLANK(E$11),\" \",IF(ISBLANK(E17),\" \",ROUND((E17+E$12)/E$10*100,0))))","v":"  "},null,{"$f":"IF(ISBLANK(G$10),\"  \",IF(ISBLANK(G$11),\" \",IF(ISBLANK(G17),\" \",ROUND((G17+G$12)/G$10*100,0))))","v":"  "},null,{"$f":"IF(ISBLANK(I$10),\"  \",IF(ISBLANK(I$11),\" \",IF(ISBLANK(I17),\" \",ROUND((I17+I$12)/I$10*100,0))))","v":"  "},null,{"$f":"IF(ISBLANK(K$10),\"  \",IF(ISBLANK(K$11),\" \",IF(ISBLANK(K17),\" \",ROUND((K17+K$12)/K$10*100,0))))","v":"  "},null,{"$f":"IF(ISBLANK(M$10),\"  \",IF(ISBLANK(M$11),\" \",IF(ISBLANK(M17),\" \",ROUND((M17+M$12)/M$10*100,0))))","v":"  "}]
[{"$f":"'S1'!A18","v":"0-5"},100,null,{"$f":"IF(ISBLANK(C$10),\"  \",IF(ISBLANK(C$11),\" \",IF(ISBLANK(C18),\" \",ROUND((C18+C$12)/C$10*100,0))))","v":"  "},null,{"$f":"IF(ISBLANK(E$10),\"  \",IF(ISBLANK(E$11),\" \",IF(ISBLANK(E18),\" \",ROUND((E18+E$12)/E$10*100,0))))","v":"  "},null,{"$f":"IF(ISBLANK(G$10),\"  \",IF(ISBLANK(G$11),\" \",IF(ISBLANK(G18),\" \",ROUND((G18+G$12)/G$10*100,0))))","v":"  "},null,{"$f":"IF(ISBLANK(I$10),\"  \",IF(ISBLANK(I$11),\" \",IF(ISBLANK(I18),\" \",ROUND((I18+I$12)/I$10*100,0))))","v":"  "},null,{"$f":"IF(ISBLANK(K$10),\"  \",IF(ISBLANK(K$11),\" \",IF(ISBLANK(K18),\" \",ROUND((K18+K$12)/K$10*100,0))))","v":"  "},null,{"$f":"IF(ISBLANK(M$10),\"  \",IF(ISBLANK(M$11),\" \",IF(ISBLANK(M18),\" \",ROUND((M18+M$12)/M$10*100,0))))","v":"  "}]
[{"$f":"'S1'!A19","v":"0-4"},200,null,{"$f":"IF(ISBLANK(C$10),\"  \",IF(ISBLANK(C$11),\" \",IF(ISBLANK(C19),\" \",ROUND((C19+C$12)/C$10*100,2))))","v":"  "},null,{"$f":"IF(ISBLANK(E$10),\"  \",IF(ISBLANK(E$11),\" \",IF(ISBLANK(E19),\" \",ROUND((E19+E$12)/E$10*100,2))))","v":"  "},null,{"$f":"IF(ISBLANK(G$10),\"  \",IF(ISBLANK(G$11),\" \",IF(ISBLANK(G19),\" \",ROUND((G19+G$12)/G$10*100,2))))","v":"  "},null,{"$f":"IF(ISBLANK(I$10),\"  \",IF(ISBLANK(I$11),\" \",IF(ISBLANK(I19),\" \",ROUND((I19+I$12)/I$10*100,2))))","v":"  "},null,{"$f":"IF(ISBLANK(K$10),\"  \",IF(ISBLANK(K$11),\" \",IF(ISBLANK(K19),\" \",ROUND((K19+K$12)/K$10*100,2))))","v":"  "},null,{"$f":"IF(ISBLANK(M$10),\"  \",IF(ISBLANK(M$11),\" \",IF(ISBLANK(M19),\" \",ROUND((M19+M$12)/M$10*100,2))))","v":"  "}]
["Tested By"]
["Remarks"]
[]
[]
[]
[]
["Sample No."]
["Date"]
["St Wt Before Wash",null,null,"% Loss",null,"% Loss",null,"% Loss",null,"% Loss",null,"% Loss",null,"% Loss"]
["Dry Wt After Wash",null,null,{"$f":"IF(ISBLANK(C28),\" \",IF(ISBLANK(C32),\" \",(C29-C32)/C29*100))","v":" "},null,{"$f":"IF(ISBLANK(E28),\" \",IF(ISBLANK(E32),\" \",(E29-E32)/E29*100))","v":" "},null,{"$f":"IF(ISBLANK(G28),\" \",IF(ISBLANK(G32),\" \",(G29-G32)/G29*100))","v":" "},null,{"$f":"IF(ISBLANK(I28),\" \",IF(ISBLANK(I32),\" \",(I29-I32)/I29*100))","v":" "},null,{"$f":"IF(ISBLANK(K28),\" \",IF(ISBLANK(K32),\" \",(K29-K32)/K29*100))","v":" "},null,{"$f":"IF(ISBLANK(M28),\" \",IF(ISBLANK(M32),\" \",(M29-M32)/M29*100))","v":" "}]
["Wt. Loss",null,{"$f":"IF(ISBLANK(C28),\" \",IF(ISBLANK(C29),\" \",C28-C29))","v":" "},null,{"$f":"IF(ISBLANK(E28),\" \",IF(ISBLANK(E29),\" \",E28-E29))","v":" "},null,{"$f":"IF(ISBLANK(G28),\" \",IF(ISBLANK(G29),\" \",G28-G29))","v":" "},null,{"$f":"IF(ISBLANK(I28),\" \",IF(ISBLANK(I29),\" \",I28-I29))","v":" "},null,{"$f":"IF(ISBLANK(K28),\" \",IF(ISBLANK(K29),\" \",K28-K29))","v":" "},null,{"$f":"IF(ISBLANK(M28),\" \",IF(ISBLANK(M29),\" \",M28-M29))","v":" "}]
["Spec","Sieve","Wt","% Passing","Wt","% Passing","Wt","% Passing","Wt","% Passing","Wt","% Passing","Wt","% Passing"]
[{"$f":"'S1'!A32","v":100},0.375,null,{"$f":"IF(ISBLANK(C$28),\"  \",IF(ISBLANK(C$29),\" \",IF(ISBLANK(C32),\" \",ROUND((C32+C$30)/C$28*100,1))))","v":"  "},null,{"$f":"IF(ISBLANK(E$28),\"  \",IF(ISBLANK(E$29),\" \",IF(ISBLANK(E32),\" \",ROUND((E32+E$30)/E$28*100,1))))","v":"  "},null,{"$f":"IF(ISBLANK(G$28),\"  \",IF(ISBLANK(G$29),\" \",IF(ISBLANK(G32),\" \",ROUND((G32+G$30)/G$28*100,1))))","v":"  "},null,{"$f":"IF(ISBLANK(I$28),\"  \",IF(ISBLANK(I$29),\" \",IF(ISBLANK(I32),\" \",ROUND((I32+I$30)/I$28*100,1))))","v":"  "},null,{"$f":"IF(ISBLANK(K$28),\"  \",IF(ISBLANK(K$29),\" \",IF(ISBLANK(K32),\" \",ROUND((K32+K$30)/K$28*100,1))))","v":"  "},null,{"$f":"IF(ISBLANK(M$28),\"  \",IF(ISBLANK(M$29),\" \",IF(ISBLANK(M32),\" \",ROUND((M32+M$30)/M$28*100,1))))","v":"  "}]
[{"$f":"'S1'!A33","v":"Breaker"},0.25,null,{"$f":"IF(ISBLANK(C$28),\"  \",IF(ISBLANK(C$29),\" \",IF(ISBLANK(C33),\" \",ROUND((C33+C$30)/C$28*100,0))))","v":"  "},null,{"$f":"IF(ISBLANK(E$28),\"  \",IF(ISBLANK(E$29),\" \",IF(ISBLANK(E33),\" \",ROUND((E33+E$30)/E$28*100,0))))","v":"  "},null,{"$f":"IF(ISBLANK(G$28),\"  \",IF(ISBLANK(G$29),\" \",IF(ISBLANK(G33),\" \",ROUND((G33+G$30)/G$28*100,0))))","v":"  "},null,{"$f":"IF(ISBLANK(I$28),\"  \",IF(ISBLANK(I$29),\" \",IF(ISBLANK(I33),\" \",ROUND((I33+I$30)/I$28*100,0))))","v":"  "},null,{"$f":"IF(ISBLANK(K$28),\"  \",IF(ISBLANK(K$29),\" \",IF(ISBLANK(K33),\" \",ROUND((K33+K$30)/K$28*100,0))))","v":"  "},null,{"$f":"IF(ISBLANK(M$28),\"  \",IF(ISBLANK(M$29),\" \",IF(ISBLANK(M33),\" \",ROUND((M33+M$30)/M$28*100,0))))","v":"  "}]
[{"$f":"'S1'!A34","v":"85-100"},4,null,{"$f":"IF(ISBLANK(C$28),\"  \",IF(ISBLANK(C$29),\" \",IF(ISBLANK(C34),\" \",ROUND((C34+C$30)/C$28*100,0))))","v":"  "},null,{"$f":"IF(ISBLANK(E$28),\"  \",IF(ISBLANK(E$29),\" \",IF(ISBLANK(E34),\" \",ROUND((E34+E$30)/E$28*100,0))))","v":"  "},null,{"$f":"IF(ISBLANK(G$28),\"  \",IF(ISBLANK(G$29),\" \",IF(ISBLANK(G34),\" \",ROUND((G34+G$30)/G$28*100,0))))","v":"  "},null,{"$f":"IF(ISBLANK(I$28),\"  \",IF(ISBLANK(I$29),\" \",IF(ISBLANK(I34),\" \",ROUND((I34+I$30)/I$28*100,0))))","v":"  "},null,{"$f":"IF(ISBLANK(K$28),\"  \",IF(ISBLANK(K$29),\" \",IF(ISBLANK(K34),\" \",ROUND((K34+K$30)/K$28*100,0))))","v":"  "},null,{"$f":"IF(ISBLANK(M$28),\"  \",IF(ISBLANK(M$29),\" \",IF(ISBLANK(M34),\" \",ROUND((M34+M$30)/M$28*100,0))))","v":"  "}]
[{"$f":"'S1'!A35","v":"0-55"},8,null,{"$f":"IF(ISBLANK(C$28),\"  \",IF(ISBLANK(C$29),\" \",IF(ISBLANK(C35),\" \",ROUND((C35+C$30)/C$28*100,0))))","v":"  "},null,{"$f":"IF(ISBLANK(E$28),\"  \",IF(ISBLANK(E$29),\" \",IF(ISBLANK(E35),\" \",ROUND((E35+E$30)/E$28*100,0))))","v":"  "},null,{"$f":"IF(ISBLANK(G$28),\"  \",IF(ISBLANK(G$29),\" \",IF(ISBLANK(G35),\" \",ROUND((G35+G$30)/G$28*100,0))))","v":"  "},null,{"$f":"IF(ISBLANK(I$28),\"  \",IF(ISBLANK(I$29),\" \",IF(ISBLANK(I35),\" \",ROUND((I35+I$30)/I$28*100,0))))","v":"  "},null,{"$f":"IF(ISBLANK(K$28),\"  \",IF(ISBLANK(K$29),\" \",IF(ISBLANK(K35),\" \",ROUND((K35+K$30)/K$28*100,0))))","v":"  "},null,{"$f":"IF(ISBLANK(M$28),\"  \",IF(ISBLANK(M$29),\" \",IF(ISBLANK(M35),\" \",ROUND((M35+M$30)/M$28*100,0))))","v":"  "}]
[{"$f":"'S1'!A36","v":"0-5"},100,null,{"$f":"IF(ISBLANK(C$28),\"  \",IF(ISBLANK(C$29),\" \",IF(ISBLANK(C36),\" \",ROUND((C36+C$30)/C$28*100,0))))","v":"  "},null,{"$f":"IF(ISBLANK(E$28),\"  \",IF(ISBLANK(E$29),\" \",IF(ISBLANK(E36),\" \",ROUND((E36+E$30)/E$28*100,0))))","v":"  "},null,{"$f":"IF(ISBLANK(G$28),\"  \",IF(ISBLANK(G$29),\" \",IF(ISBLANK(G36),\" \",ROUND((G36+G$30)/G$28*100,0))))","v":"  "},null,{"$f":"IF(ISBLANK(I$28),\"  \",IF(ISBLANK(I$29),\" \",IF(ISBLANK(I36),\" \",ROUND((I36+I$30)/I$28*100,0))))","v":"  "},null,{"$f":"IF(ISBLANK(K$28),\"  \",IF(ISBLANK(K$29),\" \",IF(ISBLANK(K36),\" \",ROUND((K36+K$30)/K$28*100,0))))","v":"  "},null,{"$f":"IF(ISBLANK(M$28),\"  \",IF(ISBLANK(M$29),\" \",IF(ISBLANK(M36),\" \",ROUND((M36+M$30)/M$28*100,0))))","v":"  "}]
[{"$f":"'S1'!A37","v":"0-4"},200,null,{"$f":"IF(ISBLANK(C$28),\"  \",IF(ISBLANK(C$29),\" \",IF(ISBLANK(C37),\" \",ROUND((C37+C$30)/C$28*100,2))))","v":"  "},null,{"$f":"IF(ISBLANK(E$28),\"  \",IF(ISBLANK(E$29),\" \",IF(ISBLANK(E37),\" \",ROUND((E37+E$30)/E$28*100,2))))","v":"  "},null,{"$f":"IF(ISBLANK(G$28),\"  \",IF(ISBLANK(G$29),\" \",IF(ISBLANK(G37),\" \",ROUND((G37+G$30)/G$28*100,2))))","v":"  "},null,{"$f":"IF(ISBLANK(I$28),\"  \",IF(ISBLANK(I$29),\" \",IF(ISBLANK(I37),\" \",ROUND((I37+I$30)/I$28*100,2))))","v":"  "},null,{"$f":"IF(ISBLANK(K$28),\"  \",IF(ISBLANK(K$29),\" \",IF(ISBLANK(K37),\" \",ROUND((K37+K$30)/K$28*100,2))))","v":"  "},null,{"$f":"IF(ISBLANK(M$28),\"  \",IF(ISBLANK(M$29),\" \",IF(ISBLANK(M37),\" \",ROUND((M37+M$30)/M$28*100,2))))","v":"  "}]
["Tested By"]
["Remarks"]

{"sheet":"S8","index":7,"n_rows":39,"n_cols":14,"rows_kept":39,"cut":false,"hidden":true,"merged":[[4,0,4,1],[37,2,37,3],[29,12,29,13],[37,12,37,13],[38,0,41,1],[38,2,41,3],[38,4,41,5],[38,6,41,7],[38,8,41,9],[38,10,41,11],[38,12,41,13],[29,4,29,5],[29,6,29,7],[29,8,29,9],[37,10,37,11],[37,4,37,5],[37,6,37,7],[37,8,37,9],[11,0,11,1],[11,2,11,3],[20,8,23,9],[19,0,19,1],[37,0,37,1],[19,4,19,5],[19,6,19,7],[19,8,19,9],[29,0,29,1],[20,10,23,11],[26,8,26,9],[26,10,26,11],[28,0,28,1],[27,0,27,1],[25,0,25,1],[26,0,26,1],[25,10,25,11],[20,0,23,1],[20,2,23,3],[20,4,23,5],[26,4,26,5],[26,6,26,7],[25,4,25,5],[25,6,25,7],[25,8,25,9],[20,12,23,13],[25,12,25,13],[26,12,26,13],[29,2,29,3],[11,10,11,11],[11,12,11,13],[11,4,11,5],[11,6,11,7],[11,8,11,9],[19,12,19,13],[29,10,29,11],[20,6,23,7],[26,2,26,3],[19,2,19,3],[25,2,25,3],[19,10,19,11],[10,0,10,1],[9,0,9,1],[7,10,7,11],[7,12,7,13],[8,0,8,1],[8,2,8,3],[8,4,8,5],[8,6,8,7],[8,8,8,9],[8,10,8,11],[8,12,8,13],[5,3,5,8],[7,0,7,1],[7,2,7,3],[7,4,7,5],[7,6,7,7],[7,8,7,9],[3,10,3,11],[3,12,3,13],[0,0,3,1],[1,10,1,11],[1,12,1,13],[2,10,2,11],[2,12,2,13],[0,8,3,9],[1,2,1,7],[2,2,2,7],[3,2,3,7]]}
[]
[null,null,"COMMONWEALTH OF PENNSYLVANIA",null,null,null,null,null,null,null,"DISTRICT",null,{"$f":"IF(ISBLANK('S1'!L2),\"\",'S1'!L2)","v":""}]
[null,null,"DEPARTMENT OF TRANSPORTATION",null,null,null,null,null,null,null,"PLANT CODE",null,{"$f":"IF(ISBLANK('S1'!L3),\"\",'S1'!L3)","v":""}]
[null,null,"PENNSYLVANIA TURNPIKE COMMISSION",null,null,null,null,null,null,null,"AGG SIZE",null,{"$f":"IF(ISBLANK('S1'!L4),\"\",'S1'!L4)","v":"Type 3B"}]
[{"$f":"'S1'!A5","v":"Aggregate 2023"}]
[null,null,null,{"$f":"'S1'!D6","v":"Material Test Results for Type 3B Anti-Skid"}]
[]
["Sample No."]
["Date"]
["St Wt Before Wash",null,null,"% Loss",null,"% Loss",null,"% Loss",null,"% Loss",null,"% Loss",null,"% Loss"]
["Dry Wt After Wash",null,null,{"$f":"IF(ISBLANK(C10),\" \",IF(ISBLANK(C14),\" \",(C11-C14)/C11*100))","v":" "},null,{"$f":"IF(ISBLANK(E10),\" \",IF(ISBLANK(E14),\" \",(E11-E14)/E11*100))","v":" "},null,{"$f":"IF(ISBLANK(G10),\" \",IF(ISBLANK(G14),\" \",(G11-G14)/G11*100))","v":" "},null,{"$f":"IF(ISBLANK(I10),\" \",IF(ISBLANK(I14),\" \",(I11-I14)/I11*100))","v":" "},null,{"$f":"IF(ISBLANK(K10),\" \",IF(ISBLANK(K14),\" \",(K11-K14)/K11*100))","v":" "},null,{"$f":"IF(ISBLANK(M10),\" \",IF(ISBLANK(M14),\" \",(M11-M14)/M11*100))","v":" "}]
["Wt. Loss",null,{"$f":"IF(ISBLANK(C10),\" \",IF(ISBLANK(C11),\" \",C10-C11))","v":" "},null,{"$f":"IF(ISBLANK(E10),\" \",IF(ISBLANK(E11),\" \",E10-E11))","v":" "},null,{"$f":"IF(ISBLANK(G10),\" \",IF(ISBLANK(G11),\" \",G10-G11))","v":" "},null,{"$f":"IF(ISBLANK(I10),\" \",IF(ISBLANK(I11),\" \",I10-I11))","v":" "},null,{"$f":"IF(ISBLANK(K10),\" \",IF(ISBLANK(K11),\" \",K10-K11))","v":" "},null,{"$f":"IF(ISBLANK(M10),\" \",IF(ISBLANK(M11),\" \",M10-M11))","v":" "}]
["Spec","Sieve","Wt","% Passing","Wt","% Passing","Wt","% Passing","Wt","% Passing","Wt","% Passing","Wt","% Passing"]
[{"$f":"'S1'!A14","v":"100"},0.375,null,{"$f":"IF(ISBLANK(C$10),\"  \",IF(ISBLANK(C$11),\" \",IF(ISBLANK(C14),\" \",ROUND((C14+C$12)/C$10*100,1))))","v":"  "},null,{"$f":"IF(ISBLANK(E$10),\"  \",IF(ISBLANK(E$11),\" \",IF(ISBLANK(E14),\" \",ROUND((E14+E$12)/E$10*100,1))))","v":"  "},null,{"$f":"IF(ISBLANK(G$10),\"  \",IF(ISBLANK(G$11),\" \",IF(ISBLANK(G14),\" \",ROUND((G14+G$12)/G$10*100,1))))","v":"  "},null,{"$f":"IF(ISBLANK(I$10),\"  \",IF(ISBLANK(I$11),\" \",IF(ISBLANK(I14),\" \",ROUND((I14+I$12)/I$10*100,1))))","v":"  "},null,{"$f":"IF(ISBLANK(K$10),\"  \",IF(ISBLANK(K$11),\" \",IF(ISBLANK(K14),\" \",ROUND((K14+K$12)/K$10*100,1))))","v":"  "},null,{"$f":"IF(ISBLANK(M$10),\"  \",IF(ISBLANK(M$11),\" \",IF(ISBLANK(M14),\" \",ROUND((M14+M$12)/M$10*100,1))))","v":"  "}]
[{"$f":"'S1'!A15","v":"Breaker"},0.25,null,{"$f":"IF(ISBLANK(C$10),\"  \",IF(ISBLANK(C$11),\" \",IF(ISBLANK(C15),\" \",ROUND((C15+C$12)/C$10*100,0))))","v":"  "},null,{"$f":"IF(ISBLANK(E$10),\"  \",IF(ISBLANK(E$11),\" \",IF(ISBLANK(E15),\" \",ROUND((E15+E$12)/E$10*100,0))))","v":"  "},null,{"$f":"IF(ISBLANK(G$10),\"  \",IF(ISBLANK(G$11),\" \",IF(ISBLANK(G15),\" \",ROUND((G15+G$12)/G$10*100,0))))","v":"  "},null,{"$f":"IF(ISBLANK(I$10),\"  \",IF(ISBLANK(I$11),\" \",IF(ISBLANK(I15),\" \",ROUND((I15+I$12)/I$10*100,0))))","v":"  "},null,{"$f":"IF(ISBLANK(K$10),\"  \",IF(ISBLANK(K$11),\" \",IF(ISBLANK(K15),\" \",ROUND((K15+K$12)/K$10*100,0))))","v":"  "},null,{"$f":"IF(ISBLANK(M$10),\"  \",IF(ISBLANK(M$11),\" \",IF(ISBLANK(M15),\" \",ROUND((M15+M$12)/M$10*100,0))))","v":"  "}]
[{"$f":"'S1'!A16","v":"85-100"},4,null,{"$f":"IF(ISBLANK(C$10),\"  \",IF(ISBLANK(C$11),\" \",IF(ISBLANK(C16),\" \",ROUND((C16+C$12)/C$10*100,0))))","v":"  "},null,{"$f":"IF(ISBLANK(E$10),\"  \",IF(ISBLANK(E$11),\" \",IF(ISBLANK(E16),\" \",ROUND((E16+E$12)/E$10*100,0))))","v":"  "},null,{"$f":"IF(ISBLANK(G$10),\"  \",IF(ISBLANK(G$11),\" \",IF(ISBLANK(G16),\" \",ROUND((G16+G$12)/G$10*100,0))))","v":"  "},null,{"$f":"IF(ISBLANK(I$10),\"  \",IF(ISBLANK(I$11),\" \",IF(ISBLANK(I16),\" \",ROUND((I16+I$12)/I$10*100,0))))","v":"  "},null,{"$f":"IF(ISBLANK(K$10),\"  \",IF(ISBLANK(K$11),\" \",IF(ISBLANK(K16),\" \",ROUND((K16+K$12)/K$10*100,0))))","v":"  "},null,{"$f":"IF(ISBLANK(M$10),\"  \",IF(ISBLANK(M$11),\" \",IF(ISBLANK(M16),\" \",ROUND((M16+M$12)/M$10*100,0))))","v":"  "}]
[{"$f":"'S1'!A17","v":"0-55"},8,null,{"$f":"IF(ISBLANK(C$10),\"  \",IF(ISBLANK(C$11),\" \",IF(ISBLANK(C17),\" \",ROUND((C17+C$12)/C$10*100,0))))","v":"  "},null,{"$f":"IF(ISBLANK(E$10),\"  \",IF(ISBLANK(E$11),\" \",IF(ISBLANK(E17),\" \",ROUND((E17+E$12)/E$10*100,0))))","v":"  "},null,{"$f":"IF(ISBLANK(G$10),\"  \",IF(ISBLANK(G$11),\" \",IF(ISBLANK(G17),\" \",ROUND((G17+G$12)/G$10*100,0))))","v":"  "},null,{"$f":"IF(ISBLANK(I$10),\"  \",IF(ISBLANK(I$11),\" \",IF(ISBLANK(I17),\" \",ROUND((I17+I$12)/I$10*100,0))))","v":"  "},null,{"$f":"IF(ISBLANK(K$10),\"  \",IF(ISBLANK(K$11),\" \",IF(ISBLANK(K17),\" \",ROUND((K17+K$12)/K$10*100,0))))","v":"  "},null,{"$f":"IF(ISBLANK(M$10),\"  \",IF(ISBLANK(M$11),\" \",IF(ISBLANK(M17),\" \",ROUND((M17+M$12)/M$10*100,0))))","v":"  "}]
[{"$f":"'S1'!A18","v":"0-5"},100,null,{"$f":"IF(ISBLANK(C$10),\"  \",IF(ISBLANK(C$11),\" \",IF(ISBLANK(C18),\" \",ROUND((C18+C$12)/C$10*100,0))))","v":"  "},null,{"$f":"IF(ISBLANK(E$10),\"  \",IF(ISBLANK(E$11),\" \",IF(ISBLANK(E18),\" \",ROUND((E18+E$12)/E$10*100,0))))","v":"  "},null,{"$f":"IF(ISBLANK(G$10),\"  \",IF(ISBLANK(G$11),\" \",IF(ISBLANK(G18),\" \",ROUND((G18+G$12)/G$10*100,0))))","v":"  "},null,{"$f":"IF(ISBLANK(I$10),\"  \",IF(ISBLANK(I$11),\" \",IF(ISBLANK(I18),\" \",ROUND((I18+I$12)/I$10*100,0))))","v":"  "},null,{"$f":"IF(ISBLANK(K$10),\"  \",IF(ISBLANK(K$11),\" \",IF(ISBLANK(K18),\" \",ROUND((K18+K$12)/K$10*100,0))))","v":"  "},null,{"$f":"IF(ISBLANK(M$10),\"  \",IF(ISBLANK(M$11),\" \",IF(ISBLANK(M18),\" \",ROUND((M18+M$12)/M$10*100,0))))","v":"  "}]
[{"$f":"'S1'!A19","v":"0-4"},200,null,{"$f":"IF(ISBLANK(C$10),\"  \",IF(ISBLANK(C$11),\" \",IF(ISBLANK(C19),\" \",ROUND((C19+C$12)/C$10*100,2))))","v":"  "},null,{"$f":"IF(ISBLANK(E$10),\"  \",IF(ISBLANK(E$11),\" \",IF(ISBLANK(E19),\" \",ROUND((E19+E$12)/E$10*100,2))))","v":"  "},null,{"$f":"IF(ISBLANK(G$10),\"  \",IF(ISBLANK(G$11),\" \",IF(ISBLANK(G19),\" \",ROUND((G19+G$12)/G$10*100,2))))","v":"  "},null,{"$f":"IF(ISBLANK(I$10),\"  \",IF(ISBLANK(I$11),\" \",IF(ISBLANK(I19),\" \",ROUND((I19+I$12)/I$10*100,2))))","v":"  "},null,{"$f":"IF(ISBLANK(K$10),\"  \",IF(ISBLANK(K$11),\" \",IF(ISBLANK(K19),\" \",ROUND((K19+K$12)/K$10*100,2))))","v":"  "},null,{"$f":"IF(ISBLANK(M$10),\"  \",IF(ISBLANK(M$11),\" \",IF(ISBLANK(M19),\" \",ROUND((M19+M$12)/M$10*100,2))))","v":"  "}]
["Tested By"]
["Remarks"]
[]
[]
[]
[]
["Sample No."]
["Date"]
["St Wt Before Wash",null,null,"% Loss",null,"% Loss",null,"% Loss",null,"% Loss",null,"% Loss",null,"% Loss"]
["Dry Wt After Wash",null,null,{"$f":"IF(ISBLANK(C28),\" \",IF(ISBLANK(C32),\" \",(C29-C32)/C29*100))","v":" "},null,{"$f":"IF(ISBLANK(E28),\" \",IF(ISBLANK(E32),\" \",(E29-E32)/E29*100))","v":" "},null,{"$f":"IF(ISBLANK(G28),\" \",IF(ISBLANK(G32),\" \",(G29-G32)/G29*100))","v":" "},null,{"$f":"IF(ISBLANK(I28),\" \",IF(ISBLANK(I32),\" \",(I29-I32)/I29*100))","v":" "},null,{"$f":"IF(ISBLANK(K28),\" \",IF(ISBLANK(K32),\" \",(K29-K32)/K29*100))","v":" "},null,{"$f":"IF(ISBLANK(M28),\" \",IF(ISBLANK(M32),\" \",(M29-M32)/M29*100))","v":" "}]
["Wt. Loss",null,{"$f":"IF(ISBLANK(C28),\" \",IF(ISBLANK(C29),\" \",C28-C29))","v":" "},null,{"$f":"IF(ISBLANK(E28),\" \",IF(ISBLANK(E29),\" \",E28-E29))","v":" "},null,{"$f":"IF(ISBLANK(G28),\" \",IF(ISBLANK(G29),\" \",G28-G29))","v":" "},null,{"$f":"IF(ISBLANK(I28),\" \",IF(ISBLANK(I29),\" \",I28-I29))","v":" "},null,{"$f":"IF(ISBLANK(K28),\" \",IF(ISBLANK(K29),\" \",K28-K29))","v":" "},null,{"$f":"IF(ISBLANK(M28),\" \",IF(ISBLANK(M29),\" \",M28-M29))","v":" "}]
["Spec","Sieve","Wt","% Passing","Wt","% Passing","Wt","% Passing","Wt","% Passing","Wt","% Passing","Wt","% Passing"]
[{"$f":"'S1'!A32","v":100},0.375,null,{"$f":"IF(ISBLANK(C$28),\"  \",IF(ISBLANK(C$29),\" \",IF(ISBLANK(C32),\" \",ROUND((C32+C$30)/C$28*100,1))))","v":"  "},null,{"$f":"IF(ISBLANK(E$28),\"  \",IF(ISBLANK(E$29),\" \",IF(ISBLANK(E32),\" \",ROUND((E32+E$30)/E$28*100,1))))","v":"  "},null,{"$f":"IF(ISBLANK(G$28),\"  \",IF(ISBLANK(G$29),\" \",IF(ISBLANK(G32),\" \",ROUND((G32+G$30)/G$28*100,1))))","v":"  "},null,{"$f":"IF(ISBLANK(I$28),\"  \",IF(ISBLANK(I$29),\" \",IF(ISBLANK(I32),\" \",ROUND((I32+I$30)/I$28*100,1))))","v":"  "},null,{"$f":"IF(ISBLANK(K$28),\"  \",IF(ISBLANK(K$29),\" \",IF(ISBLANK(K32),\" \",ROUND((K32+K$30)/K$28*100,1))))","v":"  "},null,{"$f":"IF(ISBLANK(M$28),\"  \",IF(ISBLANK(M$29),\" \",IF(ISBLANK(M32),\" \",ROUND((M32+M$30)/M$28*100,1))))","v":"  "}]
[{"$f":"'S1'!A33","v":"Breaker"},0.25,null,{"$f":"IF(ISBLANK(C$28),\"  \",IF(ISBLANK(C$29),\" \",IF(ISBLANK(C33),\" \",ROUND((C33+C$30)/C$28*100,0))))","v":"  "},null,{"$f":"IF(ISBLANK(E$28),\"  \",IF(ISBLANK(E$29),\" \",IF(ISBLANK(E33),\" \",ROUND((E33+E$30)/E$28*100,0))))","v":"  "},null,{"$f":"IF(ISBLANK(G$28),\"  \",IF(ISBLANK(G$29),\" \",IF(ISBLANK(G33),\" \",ROUND((G33+G$30)/G$28*100,0))))","v":"  "},null,{"$f":"IF(ISBLANK(I$28),\"  \",IF(ISBLANK(I$29),\" \",IF(ISBLANK(I33),\" \",ROUND((I33+I$30)/I$28*100,0))))","v":"  "},null,{"$f":"IF(ISBLANK(K$28),\"  \",IF(ISBLANK(K$29),\" \",IF(ISBLANK(K33),\" \",ROUND((K33+K$30)/K$28*100,0))))","v":"  "},null,{"$f":"IF(ISBLANK(M$28),\"  \",IF(ISBLANK(M$29),\" \",IF(ISBLANK(M33),\" \",ROUND((M33+M$30)/M$28*100,0))))","v":"  "}]
[{"$f":"'S1'!A34","v":"85-100"},4,null,{"$f":"IF(ISBLANK(C$28),\"  \",IF(ISBLANK(C$29),\" \",IF(ISBLANK(C34),\" \",ROUND((C34+C$30)/C$28*100,0))))","v":"  "},null,{"$f":"IF(ISBLANK(E$28),\"  \",IF(ISBLANK(E$29),\" \",IF(ISBLANK(E34),\" \",ROUND((E34+E$30)/E$28*100,0))))","v":"  "},null,{"$f":"IF(ISBLANK(G$28),\"  \",IF(ISBLANK(G$29),\" \",IF(ISBLANK(G34),\" \",ROUND((G34+G$30)/G$28*100,0))))","v":"  "},null,{"$f":"IF(ISBLANK(I$28),\"  \",IF(ISBLANK(I$29),\" \",IF(ISBLANK(I34),\" \",ROUND((I34+I$30)/I$28*100,0))))","v":"  "},null,{"$f":"IF(ISBLANK(K$28),\"  \",IF(ISBLANK(K$29),\" \",IF(ISBLANK(K34),\" \",ROUND((K34+K$30)/K$28*100,0))))","v":"  "},null,{"$f":"IF(ISBLANK(M$28),\"  \",IF(ISBLANK(M$29),\" \",IF(ISBLANK(M34),\" \",ROUND((M34+M$30)/M$28*100,0))))","v":"  "}]
[{"$f":"'S1'!A35","v":"0-55"},8,null,{"$f":"IF(ISBLANK(C$28),\"  \",IF(ISBLANK(C$29),\" \",IF(ISBLANK(C35),\" \",ROUND((C35+C$30)/C$28*100,0))))","v":"  "},null,{"$f":"IF(ISBLANK(E$28),\"  \",IF(ISBLANK(E$29),\" \",IF(ISBLANK(E35),\" \",ROUND((E35+E$30)/E$28*100,0))))","v":"  "},null,{"$f":"IF(ISBLANK(G$28),\"  \",IF(ISBLANK(G$29),\" \",IF(ISBLANK(G35),\" \",ROUND((G35+G$30)/G$28*100,0))))","v":"  "},null,{"$f":"IF(ISBLANK(I$28),\"  \",IF(ISBLANK(I$29),\" \",IF(ISBLANK(I35),\" \",ROUND((I35+I$30)/I$28*100,0))))","v":"  "},null,{"$f":"IF(ISBLANK(K$28),\"  \",IF(ISBLANK(K$29),\" \",IF(ISBLANK(K35),\" \",ROUND((K35+K$30)/K$28*100,0))))","v":"  "},null,{"$f":"IF(ISBLANK(M$28),\"  \",IF(ISBLANK(M$29),\" \",IF(ISBLANK(M35),\" \",ROUND((M35+M$30)/M$28*100,0))))","v":"  "}]
[{"$f":"'S1'!A36","v":"0-5"},100,null,{"$f":"IF(ISBLANK(C$28),\"  \",IF(ISBLANK(C$29),\" \",IF(ISBLANK(C36),\" \",ROUND((C36+C$30)/C$28*100,0))))","v":"  "},null,{"$f":"IF(ISBLANK(E$28),\"  \",IF(ISBLANK(E$29),\" \",IF(ISBLANK(E36),\" \",ROUND((E36+E$30)/E$28*100,0))))","v":"  "},null,{"$f":"IF(ISBLANK(G$28),\"  \",IF(ISBLANK(G$29),\" \",IF(ISBLANK(G36),\" \",ROUND((G36+G$30)/G$28*100,0))))","v":"  "},null,{"$f":"IF(ISBLANK(I$28),\"  \",IF(ISBLANK(I$29),\" \",IF(ISBLANK(I36),\" \",ROUND((I36+I$30)/I$28*100,0))))","v":"  "},null,{"$f":"IF(ISBLANK(K$28),\"  \",IF(ISBLANK(K$29),\" \",IF(ISBLANK(K36),\" \",ROUND((K36+K$30)/K$28*100,0))))","v":"  "},null,{"$f":"IF(ISBLANK(M$28),\"  \",IF(ISBLANK(M$29),\" \",IF(ISBLANK(M36),\" \",ROUND((M36+M$30)/M$28*100,0))))","v":"  "}]
[{"$f":"'S1'!A37","v":"0-4"},200,null,{"$f":"IF(ISBLANK(C$28),\"  \",IF(ISBLANK(C$29),\" \",IF(ISBLANK(C37),\" \",ROUND((C37+C$30)/C$28*100,2))))","v":"  "},null,{"$f":"IF(ISBLANK(E$28),\"  \",IF(ISBLANK(E$29),\" \",IF(ISBLANK(E37),\" \",ROUND((E37+E$30)/E$28*100,2))))","v":"  "},null,{"$f":"IF(ISBLANK(G$28),\"  \",IF(ISBLANK(G$29),\" \",IF(ISBLANK(G37),\" \",ROUND((G37+G$30)/G$28*100,2))))","v":"  "},null,{"$f":"IF(ISBLANK(I$28),\"  \",IF(ISBLANK(I$29),\" \",IF(ISBLANK(I37),\" \",ROUND((I37+I$30)/I$28*100,2))))","v":"  "},null,{"$f":"IF(ISBLANK(K$28),\"  \",IF(ISBLANK(K$29),\" \",IF(ISBLANK(K37),\" \",ROUND((K37+K$30)/K$28*100,2))))","v":"  "},null,{"$f":"IF(ISBLANK(M$28),\"  \",IF(ISBLANK(M$29),\" \",IF(ISBLANK(M37),\" \",ROUND((M37+M$30)/M$28*100,2))))","v":"  "}]
["Tested By"]
["Remarks"]

{"sheet":"S9","index":8,"n_rows":39,"n_cols":14,"rows_kept":39,"cut":false,"hidden":true,"merged":[[4,0,4,1],[37,2,37,3],[29,12,29,13],[37,12,37,13],[38,0,41,1],[38,2,41,3],[38,4,41,5],[38,6,41,7],[38,8,41,9],[38,10,41,11],[38,12,41,13],[29,4,29,5],[29,6,29,7],[29,8,29,9],[37,10,37,11],[37,4,37,5],[37,6,37,7],[37,8,37,9],[11,0,11,1],[11,2,11,3],[20,8,23,9],[19,0,19,1],[37,0,37,1],[19,4,19,5],[19,6,19,7],[19,8,19,9],[29,0,29,1],[20,10,23,11],[26,8,26,9],[26,10,26,11],[28,0,28,1],[27,0,27,1],[25,0,25,1],[26,0,26,1],[25,10,25,11],[20,0,23,1],[20,2,23,3],[20,4,23,5],[26,4,26,5],[26,6,26,7],[25,4,25,5],[25,6,25,7],[25,8,25,9],[20,12,23,13],[25,12,25,13],[26,12,26,13],[29,2,29,3],[11,10,11,11],[11,12,11,13],[11,4,11,5],[11,6,11,7],[11,8,11,9],[19,12,19,13],[29,10,29,11],[20,6,23,7],[26,2,26,3],[19,2,19,3],[25,2,25,3],[19,10,19,11],[10,0,10,1],[9,0,9,1],[7,10,7,11],[7,12,7,13],[8,0,8,1],[8,2,8,3],[8,4,8,5],[8,6,8,7],[8,8,8,9],[8,10,8,11],[8,12,8,13],[5,3,5,8],[7,0,7,1],[7,2,7,3],[7,4,7,5],[7,6,7,7],[7,8,7,9],[3,10,3,11],[3,12,3,13],[0,0,3,1],[1,10,1,11],[1,12,1,13],[2,10,2,11],[2,12,2,13],[0,8,3,9],[1,2,1,7],[2,2,2,7],[3,2,3,7]]}
[]
[null,null,"COMMONWEALTH OF PENNSYLVANIA",null,null,null,null,null,null,null,"DISTRICT",null,{"$f":"IF(ISBLANK('S1'!L2),\"\",'S1'!L2)","v":""}]
[null,null,"DEPARTMENT OF TRANSPORTATION",null,null,null,null,null,null,null,"PLANT CODE",null,{"$f":"IF(ISBLANK('S1'!L3),\"\",'S1'!L3)","v":""}]
[null,null,"PENNSYLVANIA TURNPIKE COMMISSION",null,null,null,null,null,null,null,"AGG SIZE",null,{"$f":"IF(ISBLANK('S1'!L4),\"\",'S1'!L4)","v":"Type 3B"}]
[{"$f":"'S1'!A5","v":"Aggregate 2023"}]
[null,null,null,{"$f":"'S1'!D6","v":"Material Test Results for Type 3B Anti-Skid"}]
[]
["Sample No."]
["Date"]
["St Wt Before Wash",null,null,"% Loss",null,"% Loss",null,"% Loss",null,"% Loss",null,"% Loss",null,"% Loss"]
["Dry Wt After Wash",null,null,{"$f":"IF(ISBLANK(C10),\" \",IF(ISBLANK(C14),\" \",(C11-C14)/C11*100))","v":" "},null,{"$f":"IF(ISBLANK(E10),\" \",IF(ISBLANK(E14),\" \",(E11-E14)/E11*100))","v":" "},null,{"$f":"IF(ISBLANK(G10),\" \",IF(ISBLANK(G14),\" \",(G11-G14)/G11*100))","v":" "},null,{"$f":"IF(ISBLANK(I10),\" \",IF(ISBLANK(I14),\" \",(I11-I14)/I11*100))","v":" "},null,{"$f":"IF(ISBLANK(K10),\" \",IF(ISBLANK(K14),\" \",(K11-K14)/K11*100))","v":" "},null,{"$f":"IF(ISBLANK(M10),\" \",IF(ISBLANK(M14),\" \",(M11-M14)/M11*100))","v":" "}]
["Wt. Loss",null,{"$f":"IF(ISBLANK(C10),\" \",IF(ISBLANK(C11),\" \",C10-C11))","v":" "},null,{"$f":"IF(ISBLANK(E10),\" \",IF(ISBLANK(E11),\" \",E10-E11))","v":" "},null,{"$f":"IF(ISBLANK(G10),\" \",IF(ISBLANK(G11),\" \",G10-G11))","v":" "},null,{"$f":"IF(ISBLANK(I10),\" \",IF(ISBLANK(I11),\" \",I10-I11))","v":" "},null,{"$f":"IF(ISBLANK(K10),\" \",IF(ISBLANK(K11),\" \",K10-K11))","v":" "},null,{"$f":"IF(ISBLANK(M10),\" \",IF(ISBLANK(M11),\" \",M10-M11))","v":" "}]
["Spec","Sieve","Wt","% Passing","Wt","% Passing","Wt","% Passing","Wt","% Passing","Wt","% Passing","Wt","% Passing"]
[{"$f":"'S1'!A14","v":"100"},0.375,null,{"$f":"IF(ISBLANK(C$10),\"  \",IF(ISBLANK(C$11),\" \",IF(ISBLANK(C14),\" \",ROUND((C14+C$12)/C$10*100,1))))","v":"  "},null,{"$f":"IF(ISBLANK(E$10),\"  \",IF(ISBLANK(E$11),\" \",IF(ISBLANK(E14),\" \",ROUND((E14+E$12)/E$10*100,1))))","v":"  "},null,{"$f":"IF(ISBLANK(G$10),\"  \",IF(ISBLANK(G$11),\" \",IF(ISBLANK(G14),\" \",ROUND((G14+G$12)/G$10*100,1))))","v":"  "},null,{"$f":"IF(ISBLANK(I$10),\"  \",IF(ISBLANK(I$11),\" \",IF(ISBLANK(I14),\" \",ROUND((I14+I$12)/I$10*100,1))))","v":"  "},null,{"$f":"IF(ISBLANK(K$10),\"  \",IF(ISBLANK(K$11),\" \",IF(ISBLANK(K14),\" \",ROUND((K14+K$12)/K$10*100,1))))","v":"  "},null,{"$f":"IF(ISBLANK(M$10),\"  \",IF(ISBLANK(M$11),\" \",IF(ISBLANK(M14),\" \",ROUND((M14+M$12)/M$10*100,1))))","v":"  "}]
[{"$f":"'S1'!A15","v":"Breaker"},0.25,null,{"$f":"IF(ISBLANK(C$10),\"  \",IF(ISBLANK(C$11),\" \",IF(ISBLANK(C15),\" \",ROUND((C15+C$12)/C$10*100,0))))","v":"  "},null,{"$f":"IF(ISBLANK(E$10),\"  \",IF(ISBLANK(E$11),\" \",IF(ISBLANK(E15),\" \",ROUND((E15+E$12)/E$10*100,0))))","v":"  "},null,{"$f":"IF(ISBLANK(G$10),\"  \",IF(ISBLANK(G$11),\" \",IF(ISBLANK(G15),\" \",ROUND((G15+G$12)/G$10*100,0))))","v":"  "},null,{"$f":"IF(ISBLANK(I$10),\"  \",IF(ISBLANK(I$11),\" \",IF(ISBLANK(I15),\" \",ROUND((I15+I$12)/I$10*100,0))))","v":"  "},null,{"$f":"IF(ISBLANK(K$10),\"  \",IF(ISBLANK(K$11),\" \",IF(ISBLANK(K15),\" \",ROUND((K15+K$12)/K$10*100,0))))","v":"  "},null,{"$f":"IF(ISBLANK(M$10),\"  \",IF(ISBLANK(M$11),\" \",IF(ISBLANK(M15),\" \",ROUND((M15+M$12)/M$10*100,0))))","v":"  "}]
[{"$f":"'S1'!A16","v":"85-100"},4,null,{"$f":"IF(ISBLANK(C$10),\"  \",IF(ISBLANK(C$11),\" \",IF(ISBLANK(C16),\" \",ROUND((C16+C$12)/C$10*100,0))))","v":"  "},null,{"$f":"IF(ISBLANK(E$10),\"  \",IF(ISBLANK(E$11),\" \",IF(ISBLANK(E16),\" \",ROUND((E16+E$12)/E$10*100,0))))","v":"  "},null,{"$f":"IF(ISBLANK(G$10),\"  \",IF(ISBLANK(G$11),\" \",IF(ISBLANK(G16),\" \",ROUND((G16+G$12)/G$10*100,0))))","v":"  "},null,{"$f":"IF(ISBLANK(I$10),\"  \",IF(ISBLANK(I$11),\" \",IF(ISBLANK(I16),\" \",ROUND((I16+I$12)/I$10*100,0))))","v":"  "},null,{"$f":"IF(ISBLANK(K$10),\"  \",IF(ISBLANK(K$11),\" \",IF(ISBLANK(K16),\" \",ROUND((K16+K$12)/K$10*100,0))))","v":"  "},null,{"$f":"IF(ISBLANK(M$10),\"  \",IF(ISBLANK(M$11),\" \",IF(ISBLANK(M16),\" \",ROUND((M16+M$12)/M$10*100,0))))","v":"  "}]
[{"$f":"'S1'!A17","v":"0-55"},8,null,{"$f":"IF(ISBLANK(C$10),\"  \",IF(ISBLANK(C$11),\" \",IF(ISBLANK(C17),\" \",ROUND((C17+C$12)/C$10*100,0))))","v":"  "},null,{"$f":"IF(ISBLANK(E$10),\"  \",IF(ISBLANK(E$11),\" \",IF(ISBLANK(E17),\" \",ROUND((E17+E$12)/E$10*100,0))))","v":"  "},null,{"$f":"IF(ISBLANK(G$10),\"  \",IF(ISBLANK(G$11),\" \",IF(ISBLANK(G17),\" \",ROUND((G17+G$12)/G$10*100,0))))","v":"  "},null,{"$f":"IF(ISBLANK(I$10),\"  \",IF(ISBLANK(I$11),\" \",IF(ISBLANK(I17),\" \",ROUND((I17+I$12)/I$10*100,0))))","v":"  "},null,{"$f":"IF(ISBLANK(K$10),\"  \",IF(ISBLANK(K$11),\" \",IF(ISBLANK(K17),\" \",ROUND((K17+K$12)/K$10*100,0))))","v":"  "},null,{"$f":"IF(ISBLANK(M$10),\"  \",IF(ISBLANK(M$11),\" \",IF(ISBLANK(M17),\" \",ROUND((M17+M$12)/M$10*100,0))))","v":"  "}]
[{"$f":"'S1'!A18","v":"0-5"},100,null,{"$f":"IF(ISBLANK(C$10),\"  \",IF(ISBLANK(C$11),\" \",IF(ISBLANK(C18),\" \",ROUND((C18+C$12)/C$10*100,0))))","v":"  "},null,{"$f":"IF(ISBLANK(E$10),\"  \",IF(ISBLANK(E$11),\" \",IF(ISBLANK(E18),\" \",ROUND((E18+E$12)/E$10*100,0))))","v":"  "},null,{"$f":"IF(ISBLANK(G$10),\"  \",IF(ISBLANK(G$11),\" \",IF(ISBLANK(G18),\" \",ROUND((G18+G$12)/G$10*100,0))))","v":"  "},null,{"$f":"IF(ISBLANK(I$10),\"  \",IF(ISBLANK(I$11),\" \",IF(ISBLANK(I18),\" \",ROUND((I18+I$12)/I$10*100,0))))","v":"  "},null,{"$f":"IF(ISBLANK(K$10),\"  \",IF(ISBLANK(K$11),\" \",IF(ISBLANK(K18),\" \",ROUND((K18+K$12)/K$10*100,0))))","v":"  "},null,{"$f":"IF(ISBLANK(M$10),\"  \",IF(ISBLANK(M$11),\" \",IF(ISBLANK(M18),\" \",ROUND((M18+M$12)/M$10*100,0))))","v":"  "}]
[{"$f":"'S1'!A19","v":"0-4"},200,null,{"$f":"IF(ISBLANK(C$10),\"  \",IF(ISBLANK(C$11),\" \",IF(ISBLANK(C19),\" \",ROUND((C19+C$12)/C$10*100,2))))","v":"  "},null,{"$f":"IF(ISBLANK(E$10),\"  \",IF(ISBLANK(E$11),\" \",IF(ISBLANK(E19),\" \",ROUND((E19+E$12)/E$10*100,2))))","v":"  "},null,{"$f":"IF(ISBLANK(G$10),\"  \",IF(ISBLANK(G$11),\" \",IF(ISBLANK(G19),\" \",ROUND((G19+G$12)/G$10*100,2))))","v":"  "},null,{"$f":"IF(ISBLANK(I$10),\"  \",IF(ISBLANK(I$11),\" \",IF(ISBLANK(I19),\" \",ROUND((I19+I$12)/I$10*100,2))))","v":"  "},null,{"$f":"IF(ISBLANK(K$10),\"  \",IF(ISBLANK(K$11),\" \",IF(ISBLANK(K19),\" \",ROUND((K19+K$12)/K$10*100,2))))","v":"  "},null,{"$f":"IF(ISBLANK(M$10),\"  \",IF(ISBLANK(M$11),\" \",IF(ISBLANK(M19),\" \",ROUND((M19+M$12)/M$10*100,2))))","v":"  "}]
["Tested By"]
["Remarks"]
[]
[]
[]
[]
["Sample No."]
["Date"]
["St Wt Before Wash",null,null,"% Loss",null,"% Loss",null,"% Loss",null,"% Loss",null,"% Loss",null,"% Loss"]
["Dry Wt After Wash",null,null,{"$f":"IF(ISBLANK(C28),\" \",IF(ISBLANK(C32),\" \",(C29-C32)/C29*100))","v":" "},null,{"$f":"IF(ISBLANK(E28),\" \",IF(ISBLANK(E32),\" \",(E29-E32)/E29*100))","v":" "},null,{"$f":"IF(ISBLANK(G28),\" \",IF(ISBLANK(G32),\" \",(G29-G32)/G29*100))","v":" "},null,{"$f":"IF(ISBLANK(I28),\" \",IF(ISBLANK(I32),\" \",(I29-I32)/I29*100))","v":" "},null,{"$f":"IF(ISBLANK(K28),\" \",IF(ISBLANK(K32),\" \",(K29-K32)/K29*100))","v":" "},null,{"$f":"IF(ISBLANK(M28),\" \",IF(ISBLANK(M32),\" \",(M29-M32)/M29*100))","v":" "}]
["Wt. Loss",null,{"$f":"IF(ISBLANK(C28),\" \",IF(ISBLANK(C29),\" \",C28-C29))","v":" "},null,{"$f":"IF(ISBLANK(E28),\" \",IF(ISBLANK(E29),\" \",E28-E29))","v":" "},null,{"$f":"IF(ISBLANK(G28),\" \",IF(ISBLANK(G29),\" \",G28-G29))","v":" "},null,{"$f":"IF(ISBLANK(I28),\" \",IF(ISBLANK(I29),\" \",I28-I29))","v":" "},null,{"$f":"IF(ISBLANK(K28),\" \",IF(ISBLANK(K29),\" \",K28-K29))","v":" "},null,{"$f":"IF(ISBLANK(M28),\" \",IF(ISBLANK(M29),\" \",M28-M29))","v":" "}]
["Spec","Sieve","Wt","% Passing","Wt","% Passing","Wt","% Passing","Wt","% Passing","Wt","% Passing","Wt","% Passing"]
[{"$f":"'S1'!A32","v":100},0.375,null,{"$f":"IF(ISBLANK(C$28),\"  \",IF(ISBLANK(C$29),\" \",IF(ISBLANK(C32),\" \",ROUND((C32+C$30)/C$28*100,1))))","v":"  "},null,{"$f":"IF(ISBLANK(E$28),\"  \",IF(ISBLANK(E$29),\" \",IF(ISBLANK(E32),\" \",ROUND((E32+E$30)/E$28*100,1))))","v":"  "},null,{"$f":"IF(ISBLANK(G$28),\"  \",IF(ISBLANK(G$29),\" \",IF(ISBLANK(G32),\" \",ROUND((G32+G$30)/G$28*100,1))))","v":"  "},null,{"$f":"IF(ISBLANK(I$28),\"  \",IF(ISBLANK(I$29),\" \",IF(ISBLANK(I32),\" \",ROUND((I32+I$30)/I$28*100,1))))","v":"  "},null,{"$f":"IF(ISBLANK(K$28),\"  \",IF(ISBLANK(K$29),\" \",IF(ISBLANK(K32),\" \",ROUND((K32+K$30)/K$28*100,1))))","v":"  "},null,{"$f":"IF(ISBLANK(M$28),\"  \",IF(ISBLANK(M$29),\" \",IF(ISBLANK(M32),\" \",ROUND((M32+M$30)/M$28*100,1))))","v":"  "}]
[{"$f":"'S1'!A33","v":"Breaker"},0.25,null,{"$f":"IF(ISBLANK(C$28),\"  \",IF(ISBLANK(C$29),\" \",IF(ISBLANK(C33),\" \",ROUND((C33+C$30)/C$28*100,0))))","v":"  "},null,{"$f":"IF(ISBLANK(E$28),\"  \",IF(ISBLANK(E$29),\" \",IF(ISBLANK(E33),\" \",ROUND((E33+E$30)/E$28*100,0))))","v":"  "},null,{"$f":"IF(ISBLANK(G$28),\"  \",IF(ISBLANK(G$29),\" \",IF(ISBLANK(G33),\" \",ROUND((G33+G$30)/G$28*100,0))))","v":"  "},null,{"$f":"IF(ISBLANK(I$28),\"  \",IF(ISBLANK(I$29),\" \",IF(ISBLANK(I33),\" \",ROUND((I33+I$30)/I$28*100,0))))","v":"  "},null,{"$f":"IF(ISBLANK(K$28),\"  \",IF(ISBLANK(K$29),\" \",IF(ISBLANK(K33),\" \",ROUND((K33+K$30)/K$28*100,0))))","v":"  "},null,{"$f":"IF(ISBLANK(M$28),\"  \",IF(ISBLANK(M$29),\" \",IF(ISBLANK(M33),\" \",ROUND((M33+M$30)/M$28*100,0))))","v":"  "}]
[{"$f":"'S1'!A34","v":"85-100"},4,null,{"$f":"IF(ISBLANK(C$28),\"  \",IF(ISBLANK(C$29),\" \",IF(ISBLANK(C34),\" \",ROUND((C34+C$30)/C$28*100,0))))","v":"  "},null,{"$f":"IF(ISBLANK(E$28),\"  \",IF(ISBLANK(E$29),\" \",IF(ISBLANK(E34),\" \",ROUND((E34+E$30)/E$28*100,0))))","v":"  "},null,{"$f":"IF(ISBLANK(G$28),\"  \",IF(ISBLANK(G$29),\" \",IF(ISBLANK(G34),\" \",ROUND((G34+G$30)/G$28*100,0))))","v":"  "},null,{"$f":"IF(ISBLANK(I$28),\"  \",IF(ISBLANK(I$29),\" \",IF(ISBLANK(I34),\" \",ROUND((I34+I$30)/I$28*100,0))))","v":"  "},null,{"$f":"IF(ISBLANK(K$28),\"  \",IF(ISBLANK(K$29),\" \",IF(ISBLANK(K34),\" \",ROUND((K34+K$30)/K$28*100,0))))","v":"  "},null,{"$f":"IF(ISBLANK(M$28),\"  \",IF(ISBLANK(M$29),\" \",IF(ISBLANK(M34),\" \",ROUND((M34+M$30)/M$28*100,0))))","v":"  "}]
[{"$f":"'S1'!A35","v":"0-55"},8,null,{"$f":"IF(ISBLANK(C$28),\"  \",IF(ISBLANK(C$29),\" \",IF(ISBLANK(C35),\" \",ROUND((C35+C$30)/C$28*100,0))))","v":"  "},null,{"$f":"IF(ISBLANK(E$28),\"  \",IF(ISBLANK(E$29),\" \",IF(ISBLANK(E35),\" \",ROUND((E35+E$30)/E$28*100,0))))","v":"  "},null,{"$f":"IF(ISBLANK(G$28),\"  \",IF(ISBLANK(G$29),\" \",IF(ISBLANK(G35),\" \",ROUND((G35+G$30)/G$28*100,0))))","v":"  "},null,{"$f":"IF(ISBLANK(I$28),\"  \",IF(ISBLANK(I$29),\" \",IF(ISBLANK(I35),\" \",ROUND((I35+I$30)/I$28*100,0))))","v":"  "},null,{"$f":"IF(ISBLANK(K$28),\"  \",IF(ISBLANK(K$29),\" \",IF(ISBLANK(K35),\" \",ROUND((K35+K$30)/K$28*100,0))))","v":"  "},null,{"$f":"IF(ISBLANK(M$28),\"  \",IF(ISBLANK(M$29),\" \",IF(ISBLANK(M35),\" \",ROUND((M35+M$30)/M$28*100,0))))","v":"  "}]
[{"$f":"'S1'!A36","v":"0-5"},100,null,{"$f":"IF(ISBLANK(C$28),\"  \",IF(ISBLANK(C$29),\" \",IF(ISBLANK(C36),\" \",ROUND((C36+C$30)/C$28*100,0))))","v":"  "},null,{"$f":"IF(ISBLANK(E$28),\"  \",IF(ISBLANK(E$29),\" \",IF(ISBLANK(E36),\" \",ROUND((E36+E$30)/E$28*100,0))))","v":"  "},null,{"$f":"IF(ISBLANK(G$28),\"  \",IF(ISBLANK(G$29),\" \",IF(ISBLANK(G36),\" \",ROUND((G36+G$30)/G$28*100,0))))","v":"  "},null,{"$f":"IF(ISBLANK(I$28),\"  \",IF(ISBLANK(I$29),\" \",IF(ISBLANK(I36),\" \",ROUND((I36+I$30)/I$28*100,0))))","v":"  "},null,{"$f":"IF(ISBLANK(K$28),\"  \",IF(ISBLANK(K$29),\" \",IF(ISBLANK(K36),\" \",ROUND((K36+K$30)/K$28*100,0))))","v":"  "},null,{"$f":"IF(ISBLANK(M$28),\"  \",IF(ISBLANK(M$29),\" \",IF(ISBLANK(M36),\" \",ROUND((M36+M$30)/M$28*100,0))))","v":"  "}]
[{"$f":"'S1'!A37","v":"0-4"},200,null,{"$f":"IF(ISBLANK(C$28),\"  \",IF(ISBLANK(C$29),\" \",IF(ISBLANK(C37),\" \",ROUND((C37+C$30)/C$28*100,2))))","v":"  "},null,{"$f":"IF(ISBLANK(E$28),\"  \",IF(ISBLANK(E$29),\" \",IF(ISBLANK(E37),\" \",ROUND((E37+E$30)/E$28*100,2))))","v":"  "},null,{"$f":"IF(ISBLANK(G$28),\"  \",IF(ISBLANK(G$29),\" \",IF(ISBLANK(G37),\" \",ROUND((G37+G$30)/G$28*100,2))))","v":"  "},null,{"$f":"IF(ISBLANK(I$28),\"  \",IF(ISBLANK(I$29),\" \",IF(ISBLANK(I37),\" \",ROUND((I37+I$30)/I$28*100,2))))","v":"  "},null,{"$f":"IF(ISBLANK(K$28),\"  \",IF(ISBLANK(K$29),\" \",IF(ISBLANK(K37),\" \",ROUND((K37+K$30)/K$28*100,2))))","v":"  "},null,{"$f":"IF(ISBLANK(M$28),\"  \",IF(ISBLANK(M$29),\" \",IF(ISBLANK(M37),\" \",ROUND((M37+M$30)/M$28*100,2))))","v":"  "}]
["Tested By"]
["Remarks"]

{"sheet":"S10","index":9,"n_rows":39,"n_cols":14,"rows_kept":39,"cut":false,"hidden":true,"merged":[[4,0,4,1],[37,2,37,3],[29,12,29,13],[37,12,37,13],[38,0,41,1],[38,2,41,3],[38,4,41,5],[38,6,41,7],[38,8,41,9],[38,10,41,11],[38,12,41,13],[29,4,29,5],[29,6,29,7],[29,8,29,9],[37,10,37,11],[37,4,37,5],[37,6,37,7],[37,8,37,9],[11,0,11,1],[11,2,11,3],[20,8,23,9],[19,0,19,1],[37,0,37,1],[19,4,19,5],[19,6,19,7],[19,8,19,9],[29,0,29,1],[20,10,23,11],[26,8,26,9],[26,10,26,11],[28,0,28,1],[27,0,27,1],[25,0,25,1],[26,0,26,1],[25,10,25,11],[20,0,23,1],[20,2,23,3],[20,4,23,5],[26,4,26,5],[26,6,26,7],[25,4,25,5],[25,6,25,7],[25,8,25,9],[20,12,23,13],[25,12,25,13],[26,12,26,13],[29,2,29,3],[11,10,11,11],[11,12,11,13],[11,4,11,5],[11,6,11,7],[11,8,11,9],[19,12,19,13],[29,10,29,11],[20,6,23,7],[26,2,26,3],[19,2,19,3],[25,2,25,3],[19,10,19,11],[10,0,10,1],[9,0,9,1],[7,10,7,11],[7,12,7,13],[8,0,8,1],[8,2,8,3],[8,4,8,5],[8,6,8,7],[8,8,8,9],[8,10,8,11],[8,12,8,13],[5,3,5,8],[7,0,7,1],[7,2,7,3],[7,4,7,5],[7,6,7,7],[7,8,7,9],[3,10,3,11],[3,12,3,13],[0,0,3,1],[1,10,1,11],[1,12,1,13],[2,10,2,11],[2,12,2,13],[0,8,3,9],[1,2,1,7],[2,2,2,7],[3,2,3,7]]}
[]
[null,null,"COMMONWEALTH OF PENNSYLVANIA",null,null,null,null,null,null,null,"DISTRICT",null,{"$f":"IF(ISBLANK('S1'!L2),\"\",'S1'!L2)","v":""}]
[null,null,"DEPARTMENT OF TRANSPORTATION",null,null,null,null,null,null,null,"PLANT CODE",null,{"$f":"IF(ISBLANK('S1'!L3),\"\",'S1'!L3)","v":""}]
[null,null,"PENNSYLVANIA TURNPIKE COMMISSION",null,null,null,null,null,null,null,"AGG SIZE",null,{"$f":"IF(ISBLANK('S1'!L4),\"\",'S1'!L4)","v":"Type 3B"}]
[{"$f":"'S1'!A5","v":"Aggregate 2023"}]
[null,null,null,{"$f":"'S1'!D6","v":"Material Test Results for Type 3B Anti-Skid"}]
[]
["Sample No."]
["Date"]
["St Wt Before Wash",null,null,"% Loss",null,"% Loss",null,"% Loss",null,"% Loss",null,"% Loss",null,"% Loss"]
["Dry Wt After Wash",null,null,{"$f":"IF(ISBLANK(C10),\" \",IF(ISBLANK(C14),\" \",(C11-C14)/C11*100))","v":" "},null,{"$f":"IF(ISBLANK(E10),\" \",IF(ISBLANK(E14),\" \",(E11-E14)/E11*100))","v":" "},null,{"$f":"IF(ISBLANK(G10),\" \",IF(ISBLANK(G14),\" \",(G11-G14)/G11*100))","v":" "},null,{"$f":"IF(ISBLANK(I10),\" \",IF(ISBLANK(I14),\" \",(I11-I14)/I11*100))","v":" "},null,{"$f":"IF(ISBLANK(K10),\" \",IF(ISBLANK(K14),\" \",(K11-K14)/K11*100))","v":" "},null,{"$f":"IF(ISBLANK(M10),\" \",IF(ISBLANK(M14),\" \",(M11-M14)/M11*100))","v":" "}]
["Wt. Loss",null,{"$f":"IF(ISBLANK(C10),\" \",IF(ISBLANK(C11),\" \",C10-C11))","v":" "},null,{"$f":"IF(ISBLANK(E10),\" \",IF(ISBLANK(E11),\" \",E10-E11))","v":" "},null,{"$f":"IF(ISBLANK(G10),\" \",IF(ISBLANK(G11),\" \",G10-G11))","v":" "},null,{"$f":"IF(ISBLANK(I10),\" \",IF(ISBLANK(I11),\" \",I10-I11))","v":" "},null,{"$f":"IF(ISBLANK(K10),\" \",IF(ISBLANK(K11),\" \",K10-K11))","v":" "},null,{"$f":"IF(ISBLANK(M10),\" \",IF(ISBLANK(M11),\" \",M10-M11))","v":" "}]
["Spec","Sieve","Wt","% Passing","Wt","% Passing","Wt","% Passing","Wt","% Passing","Wt","% Passing","Wt","% Passing"]
[{"$f":"'S1'!A14","v":"100"},0.375,null,{"$f":"IF(ISBLANK(C$10),\"  \",IF(ISBLANK(C$11),\" \",IF(ISBLANK(C14),\" \",ROUND((C14+C$12)/C$10*100,1))))","v":"  "},null,{"$f":"IF(ISBLANK(E$10),\"  \",IF(ISBLANK(E$11),\" \",IF(ISBLANK(E14),\" \",ROUND((E14+E$12)/E$10*100,1))))","v":"  "},null,{"$f":"IF(ISBLANK(G$10),\"  \",IF(ISBLANK(G$11),\" \",IF(ISBLANK(G14),\" \",ROUND((G14+G$12)/G$10*100,1))))","v":"  "},null,{"$f":"IF(ISBLANK(I$10),\"  \",IF(ISBLANK(I$11),\" \",IF(ISBLANK(I14),\" \",ROUND((I14+I$12)/I$10*100,1))))","v":"  "},null,{"$f":"IF(ISBLANK(K$10),\"  \",IF(ISBLANK(K$11),\" \",IF(ISBLANK(K14),\" \",ROUND((K14+K$12)/K$10*100,1))))","v":"  "},null,{"$f":"IF(ISBLANK(M$10),\"  \",IF(ISBLANK(M$11),\" \",IF(ISBLANK(M14),\" \",ROUND((M14+M$12)/M$10*100,1))))","v":"  "}]
[{"$f":"'S1'!A15","v":"Breaker"},0.25,null,{"$f":"IF(ISBLANK(C$10),\"  \",IF(ISBLANK(C$11),\" \",IF(ISBLANK(C15),\" \",ROUND((C15+C$12)/C$10*100,0))))","v":"  "},null,{"$f":"IF(ISBLANK(E$10),\"  \",IF(ISBLANK(E$11),\" \",IF(ISBLANK(E15),\" \",ROUND((E15+E$12)/E$10*100,0))))","v":"  "},null,{"$f":"IF(ISBLANK(G$10),\"  \",IF(ISBLANK(G$11),\" \",IF(ISBLANK(G15),\" \",ROUND((G15+G$12)/G$10*100,0))))","v":"  "},null,{"$f":"IF(ISBLANK(I$10),\"  \",IF(ISBLANK(I$11),\" \",IF(ISBLANK(I15),\" \",ROUND((I15+I$12)/I$10*100,0))))","v":"  "},null,{"$f":"IF(ISBLANK(K$10),\"  \",IF(ISBLANK(K$11),\" \",IF(ISBLANK(K15),\" \",ROUND((K15+K$12)/K$10*100,0))))","v":"  "},null,{"$f":"IF(ISBLANK(M$10),\"  \",IF(ISBLANK(M$11),\" \",IF(ISBLANK(M15),\" \",ROUND((M15+M$12)/M$10*100,0))))","v":"  "}]
[{"$f":"'S1'!A16","v":"85-100"},4,null,{"$f":"IF(ISBLANK(C$10),\"  \",IF(ISBLANK(C$11),\" \",IF(ISBLANK(C16),\" \",ROUND((C16+C$12)/C$10*100,0))))","v":"  "},null,{"$f":"IF(ISBLANK(E$10),\"  \",IF(ISBLANK(E$11),\" \",IF(ISBLANK(E16),\" \",ROUND((E16+E$12)/E$10*100,0))))","v":"  "},null,{"$f":"IF(ISBLANK(G$10),\"  \",IF(ISBLANK(G$11),\" \",IF(ISBLANK(G16),\" \",ROUND((G16+G$12)/G$10*100,0))))","v":"  "},null,{"$f":"IF(ISBLANK(I$10),\"  \",IF(ISBLANK(I$11),\" \",IF(ISBLANK(I16),\" \",ROUND((I16+I$12)/I$10*100,0))))","v":"  "},null,{"$f":"IF(ISBLANK(K$10),\"  \",IF(ISBLANK(K$11),\" \",IF(ISBLANK(K16),\" \",ROUND((K16+K$12)/K$10*100,0))))","v":"  "},null,{"$f":"IF(ISBLANK(M$10),\"  \",IF(ISBLANK(M$11),\" \",IF(ISBLANK(M16),\" \",ROUND((M16+M$12)/M$10*100,0))))","v":"  "}]
[{"$f":"'S1'!A17","v":"0-55"},8,null,{"$f":"IF(ISBLANK(C$10),\"  \",IF(ISBLANK(C$11),\" \",IF(ISBLANK(C17),\" \",ROUND((C17+C$12)/C$10*100,0))))","v":"  "},null,{"$f":"IF(ISBLANK(E$10),\"  \",IF(ISBLANK(E$11),\" \",IF(ISBLANK(E17),\" \",ROUND((E17+E$12)/E$10*100,0))))","v":"  "},null,{"$f":"IF(ISBLANK(G$10),\"  \",IF(ISBLANK(G$11),\" \",IF(ISBLANK(G17),\" \",ROUND((G17+G$12)/G$10*100,0))))","v":"  "},null,{"$f":"IF(ISBLANK(I$10),\"  \",IF(ISBLANK(I$11),\" \",IF(ISBLANK(I17),\" \",ROUND((I17+I$12)/I$10*100,0))))","v":"  "},null,{"$f":"IF(ISBLANK(K$10),\"  \",IF(ISBLANK(K$11),\" \",IF(ISBLANK(K17),\" \",ROUND((K17+K$12)/K$10*100,0))))","v":"  "},null,{"$f":"IF(ISBLANK(M$10),\"  \",IF(ISBLANK(M$11),\" \",IF(ISBLANK(M17),\" \",ROUND((M17+M$12)/M$10*100,0))))","v":"  "}]
[{"$f":"'S1'!A18","v":"0-5"},100,null,{"$f":"IF(ISBLANK(C$10),\"  \",IF(ISBLANK(C$11),\" \",IF(ISBLANK(C18),\" \",ROUND((C18+C$12)/C$10*100,0))))","v":"  "},null,{"$f":"IF(ISBLANK(E$10),\"  \",IF(ISBLANK(E$11),\" \",IF(ISBLANK(E18),\" \",ROUND((E18+E$12)/E$10*100,0))))","v":"  "},null,{"$f":"IF(ISBLANK(G$10),\"  \",IF(ISBLANK(G$11),\" \",IF(ISBLANK(G18),\" \",ROUND((G18+G$12)/G$10*100,0))))","v":"  "},null,{"$f":"IF(ISBLANK(I$10),\"  \",IF(ISBLANK(I$11),\" \",IF(ISBLANK(I18),\" \",ROUND((I18+I$12)/I$10*100,0))))","v":"  "},null,{"$f":"IF(ISBLANK(K$10),\"  \",IF(ISBLANK(K$11),\" \",IF(ISBLANK(K18),\" \",ROUND((K18+K$12)/K$10*100,0))))","v":"  "},null,{"$f":"IF(ISBLANK(M$10),\"  \",IF(ISBLANK(M$11),\" \",IF(ISBLANK(M18),\" \",ROUND((M18+M$12)/M$10*100,0))))","v":"  "}]
[{"$f":"'S1'!A19","v":"0-4"},200,null,{"$f":"IF(ISBLANK(C$10),\"  \",IF(ISBLANK(C$11),\" \",IF(ISBLANK(C19),\" \",ROUND((C19+C$12)/C$10*100,2))))","v":"  "},null,{"$f":"IF(ISBLANK(E$10),\"  \",IF(ISBLANK(E$11),\" \",IF(ISBLANK(E19),\" \",ROUND((E19+E$12)/E$10*100,2))))","v":"  "},null,{"$f":"IF(ISBLANK(G$10),\"  \",IF(ISBLANK(G$11),\" \",IF(ISBLANK(G19),\" \",ROUND((G19+G$12)/G$10*100,2))))","v":"  "},null,{"$f":"IF(ISBLANK(I$10),\"  \",IF(ISBLANK(I$11),\" \",IF(ISBLANK(I19),\" \",ROUND((I19+I$12)/I$10*100,2))))","v":"  "},null,{"$f":"IF(ISBLANK(K$10),\"  \",IF(ISBLANK(K$11),\" \",IF(ISBLANK(K19),\" \",ROUND((K19+K$12)/K$10*100,2))))","v":"  "},null,{"$f":"IF(ISBLANK(M$10),\"  \",IF(ISBLANK(M$11),\" \",IF(ISBLANK(M19),\" \",ROUND((M19+M$12)/M$10*100,2))))","v":"  "}]
["Tested By"]
["Remarks"]
[]
[]
[]
[]
["Sample No."]
["Date"]
["St Wt Before Wash",null,null,"% Loss",null,"% Loss",null,"% Loss",null,"% Loss",null,"% Loss",null,"% Loss"]
["Dry Wt After Wash",null,null,{"$f":"IF(ISBLANK(C28),\" \",IF(ISBLANK(C32),\" \",(C29-C32)/C29*100))","v":" "},null,{"$f":"IF(ISBLANK(E28),\" \",IF(ISBLANK(E32),\" \",(E29-E32)/E29*100))","v":" "},null,{"$f":"IF(ISBLANK(G28),\" \",IF(ISBLANK(G32),\" \",(G29-G32)/G29*100))","v":" "},null,{"$f":"IF(ISBLANK(I28),\" \",IF(ISBLANK(I32),\" \",(I29-I32)/I29*100))","v":" "},null,{"$f":"IF(ISBLANK(K28),\" \",IF(ISBLANK(K32),\" \",(K29-K32)/K29*100))","v":" "},null,{"$f":"IF(ISBLANK(M28),\" \",IF(ISBLANK(M32),\" \",(M29-M32)/M29*100))","v":" "}]
["Wt. Loss",null,{"$f":"IF(ISBLANK(C28),\" \",IF(ISBLANK(C29),\" \",C28-C29))","v":" "},null,{"$f":"IF(ISBLANK(E28),\" \",IF(ISBLANK(E29),\" \",E28-E29))","v":" "},null,{"$f":"IF(ISBLANK(G28),\" \",IF(ISBLANK(G29),\" \",G28-G29))","v":" "},null,{"$f":"IF(ISBLANK(I28),\" \",IF(ISBLANK(I29),\" \",I28-I29))","v":" "},null,{"$f":"IF(ISBLANK(K28),\" \",IF(ISBLANK(K29),\" \",K28-K29))","v":" "},null,{"$f":"IF(ISBLANK(M28),\" \",IF(ISBLANK(M29),\" \",M28-M29))","v":" "}]
["Spec","Sieve","Wt","% Passing","Wt","% Passing","Wt","% Passing","Wt","% Passing","Wt","% Passing","Wt","% Passing"]
[{"$f":"'S1'!A32","v":100},0.375,null,{"$f":"IF(ISBLANK(C$28),\"  \",IF(ISBLANK(C$29),\" \",IF(ISBLANK(C32),\" \",ROUND((C32+C$30)/C$28*100,1))))","v":"  "},null,{"$f":"IF(ISBLANK(E$28),\"  \",IF(ISBLANK(E$29),\" \",IF(ISBLANK(E32),\" \",ROUND((E32+E$30)/E$28*100,1))))","v":"  "},null,{"$f":"IF(ISBLANK(G$28),\"  \",IF(ISBLANK(G$29),\" \",IF(ISBLANK(G32),\" \",ROUND((G32+G$30)/G$28*100,1))))","v":"  "},null,{"$f":"IF(ISBLANK(I$28),\"  \",IF(ISBLANK(I$29),\" \",IF(ISBLANK(I32),\" \",ROUND((I32+I$30)/I$28*100,1))))","v":"  "},null,{"$f":"IF(ISBLANK(K$28),\"  \",IF(ISBLANK(K$29),\" \",IF(ISBLANK(K32),\" \",ROUND((K32+K$30)/K$28*100,1))))","v":"  "},null,{"$f":"IF(ISBLANK(M$28),\"  \",IF(ISBLANK(M$29),\" \",IF(ISBLANK(M32),\" \",ROUND((M32+M$30)/M$28*100,1))))","v":"  "}]
[{"$f":"'S1'!A33","v":"Breaker"},0.25,null,{"$f":"IF(ISBLANK(C$28),\"  \",IF(ISBLANK(C$29),\" \",IF(ISBLANK(C33),\" \",ROUND((C33+C$30)/C$28*100,0))))","v":"  "},null,{"$f":"IF(ISBLANK(E$28),\"  \",IF(ISBLANK(E$29),\" \",IF(ISBLANK(E33),\" \",ROUND((E33+E$30)/E$28*100,0))))","v":"  "},null,{"$f":"IF(ISBLANK(G$28),\"  \",IF(ISBLANK(G$29),\" \",IF(ISBLANK(G33),\" \",ROUND((G33+G$30)/G$28*100,0))))","v":"  "},null,{"$f":"IF(ISBLANK(I$28),\"  \",IF(ISBLANK(I$29),\" \",IF(ISBLANK(I33),\" \",ROUND((I33+I$30)/I$28*100,0))))","v":"  "},null,{"$f":"IF(ISBLANK(K$28),\"  \",IF(ISBLANK(K$29),\" \",IF(ISBLANK(K33),\" \",ROUND((K33+K$30)/K$28*100,0))))","v":"  "},null,{"$f":"IF(ISBLANK(M$28),\"  \",IF(ISBLANK(M$29),\" \",IF(ISBLANK(M33),\" \",ROUND((M33+M$30)/M$28*100,0))))","v":"  "}]
[{"$f":"'S1'!A34","v":"85-100"},4,null,{"$f":"IF(ISBLANK(C$28),\"  \",IF(ISBLANK(C$29),\" \",IF(ISBLANK(C34),\" \",ROUND((C34+C$30)/C$28*100,0))))","v":"  "},null,{"$f":"IF(ISBLANK(E$28),\"  \",IF(ISBLANK(E$29),\" \",IF(ISBLANK(E34),\" \",ROUND((E34+E$30)/E$28*100,0))))","v":"  "},null,{"$f":"IF(ISBLANK(G$28),\"  \",IF(ISBLANK(G$29),\" \",IF(ISBLANK(G34),\" \",ROUND((G34+G$30)/G$28*100,0))))","v":"  "},null,{"$f":"IF(ISBLANK(I$28),\"  \",IF(ISBLANK(I$29),\" \",IF(ISBLANK(I34),\" \",ROUND((I34+I$30)/I$28*100,0))))","v":"  "},null,{"$f":"IF(ISBLANK(K$28),\"  \",IF(ISBLANK(K$29),\" \",IF(ISBLANK(K34),\" \",ROUND((K34+K$30)/K$28*100,0))))","v":"  "},null,{"$f":"IF(ISBLANK(M$28),\"  \",IF(ISBLANK(M$29),\" \",IF(ISBLANK(M34),\" \",ROUND((M34+M$30)/M$28*100,0))))","v":"  "}]
[{"$f":"'S1'!A35","v":"0-55"},8,null,{"$f":"IF(ISBLANK(C$28),\"  \",IF(ISBLANK(C$29),\" \",IF(ISBLANK(C35),\" \",ROUND((C35+C$30)/C$28*100,0))))","v":"  "},null,{"$f":"IF(ISBLANK(E$28),\"  \",IF(ISBLANK(E$29),\" \",IF(ISBLANK(E35),\" \",ROUND((E35+E$30)/E$28*100,0))))","v":"  "},null,{"$f":"IF(ISBLANK(G$28),\"  \",IF(ISBLANK(G$29),\" \",IF(ISBLANK(G35),\" \",ROUND((G35+G$30)/G$28*100,0))))","v":"  "},null,{"$f":"IF(ISBLANK(I$28),\"  \",IF(ISBLANK(I$29),\" \",IF(ISBLANK(I35),\" \",ROUND((I35+I$30)/I$28*100,0))))","v":"  "},null,{"$f":"IF(ISBLANK(K$28),\"  \",IF(ISBLANK(K$29),\" \",IF(ISBLANK(K35),\" \",ROUND((K35+K$30)/K$28*100,0))))","v":"  "},null,{"$f":"IF(ISBLANK(M$28),\"  \",IF(ISBLANK(M$29),\" \",IF(ISBLANK(M35),\" \",ROUND((M35+M$30)/M$28*100,0))))","v":"  "}]
[{"$f":"'S1'!A36","v":"0-5"},100,null,{"$f":"IF(ISBLANK(C$28),\"  \",IF(ISBLANK(C$29),\" \",IF(ISBLANK(C36),\" \",ROUND((C36+C$30)/C$28*100,0))))","v":"  "},null,{"$f":"IF(ISBLANK(E$28),\"  \",IF(ISBLANK(E$29),\" \",IF(ISBLANK(E36),\" \",ROUND((E36+E$30)/E$28*100,0))))","v":"  "},null,{"$f":"IF(ISBLANK(G$28),\"  \",IF(ISBLANK(G$29),\" \",IF(ISBLANK(G36),\" \",ROUND((G36+G$30)/G$28*100,0))))","v":"  "},null,{"$f":"IF(ISBLANK(I$28),\"  \",IF(ISBLANK(I$29),\" \",IF(ISBLANK(I36),\" \",ROUND((I36+I$30)/I$28*100,0))))","v":"  "},null,{"$f":"IF(ISBLANK(K$28),\"  \",IF(ISBLANK(K$29),\" \",IF(ISBLANK(K36),\" \",ROUND((K36+K$30)/K$28*100,0))))","v":"  "},null,{"$f":"IF(ISBLANK(M$28),\"  \",IF(ISBLANK(M$29),\" \",IF(ISBLANK(M36),\" \",ROUND((M36+M$30)/M$28*100,0))))","v":"  "}]
[{"$f":"'S1'!A37","v":"0-4"},200,null,{"$f":"IF(ISBLANK(C$28),\"  \",IF(ISBLANK(C$29),\" \",IF(ISBLANK(C37),\" \",ROUND((C37+C$30)/C$28*100,2))))","v":"  "},null,{"$f":"IF(ISBLANK(E$28),\"  \",IF(ISBLANK(E$29),\" \",IF(ISBLANK(E37),\" \",ROUND((E37+E$30)/E$28*100,2))))","v":"  "},null,{"$f":"IF(ISBLANK(G$28),\"  \",IF(ISBLANK(G$29),\" \",IF(ISBLANK(G37),\" \",ROUND((G37+G$30)/G$28*100,2))))","v":"  "},null,{"$f":"IF(ISBLANK(I$28),\"  \",IF(ISBLANK(I$29),\" \",IF(ISBLANK(I37),\" \",ROUND((I37+I$30)/I$28*100,2))))","v":"  "},null,{"$f":"IF(ISBLANK(K$28),\"  \",IF(ISBLANK(K$29),\" \",IF(ISBLANK(K37),\" \",ROUND((K37+K$30)/K$28*100,2))))","v":"  "},null,{"$f":"IF(ISBLANK(M$28),\"  \",IF(ISBLANK(M$29),\" \",IF(ISBLANK(M37),\" \",ROUND((M37+M$30)/M$28*100,2))))","v":"  "}]
["Tested By"]
["Remarks"]

{"sheet":"Chart 1-24","index":10,"n_rows":5,"n_cols":10,"rows_kept":5,"cut":false,"hidden":false,"merged":[[3,1,3,5],[3,7,3,8],[3,9,3,10],[4,0,4,1],[0,0,2,0],[1,1,1,5],[1,7,1,8],[1,9,1,10],[2,1,2,5],[2,7,2,8],[2,9,2,10]]}
[]
[null,"COMMONWEALTH OF PENNSYLVANIA",null,null,null,null,null,"DISTRICT",null,{"$f":"'S1'!L2","v":0}]
[null,"DEPARTMENT OF TRANSPORTATION",null,null,null,null,null,"PLANT CODE",null,{"$f":"'S1'!L3","v":0}]
[null,"PENNSYLVANIA TURNPIKE COMMISSION",null,null,null,null,null,"AGG SIZE",null,{"$f":"'S1'!L4","v":"Type 3B"}]
[{"$f":"'S1'!$A$5:$B$5","v":"Aggregate 2023"}]

{"sheet":"Chart 25-48","index":11,"n_rows":5,"n_cols":10,"rows_kept":5,"cut":false,"hidden":true,"merged":[[3,1,3,5],[3,7,3,8],[3,9,3,10],[4,0,4,1],[0,0,2,0],[1,1,1,5],[1,7,1,8],[1,9,1,10],[2,1,2,5],[2,7,2,8],[2,9,2,10]]}
[]
[null,"COMMONWEALTH OF PENNSYLVANIA",null,null,null,null,null,"DISTRICT",null,{"$f":"'S1'!L2","v":0}]
[null,"DEPARTMENT OF TRANSPORTATION",null,null,null,null,null,"PLANT CODE",null,{"$f":"'S1'!L3","v":0}]
[null,"PENNSYLVANIA TURNPIKE COMMISSION",null,null,null,null,null,"AGG SIZE",null,{"$f":"'S1'!L4","v":"Type 3B"}]
[{"$f":"'S1'!$A$5:$B$5","v":"Aggregate 2023"}]

{"sheet":"Chart 49-72","index":12,"n_rows":5,"n_cols":10,"rows_kept":5,"cut":false,"hidden":true,"merged":[[3,1,3,5],[3,7,3,8],[3,9,3,10],[4,0,4,1],[0,0,2,0],[1,1,1,5],[1,7,1,8],[1,9,1,10],[2,1,2,5],[2,7,2,8],[2,9,2,10]]}
[]
[null,"COMMONWEALTH OF PENNSYLVANIA",null,null,null,null,null,"DISTRICT",null,{"$f":"'S1'!L2","v":0}]
[null,"DEPARTMENT OF TRANSPORTATION",null,null,null,null,null,"PLANT CODE",null,{"$f":"'S1'!L3","v":0}]
[null,"PENNSYLVANIA TURNPIKE COMMISSION",null,null,null,null,null,"AGG SIZE",null,{"$f":"'S1'!L4","v":"Type 3B"}]
[{"$f":"'S1'!$A$5:$B$5","v":"Aggregate 2023"}]

{"sheet":"Chart 73-96","index":13,"n_rows":5,"n_cols":10,"rows_kept":5,"cut":false,"hidden":true,"merged":[[3,1,3,5],[3,7,3,8],[3,9,3,10],[4,0,4,1],[0,0,2,0],[1,1,1,5],[1,7,1,8],[1,9,1,10],[2,1,2,5],[2,7,2,8],[2,9,2,10]]}
[]
[null,"COMMONWEALTH OF PENNSYLVANIA",null,null,null,null,null,"DISTRICT",null,{"$f":"'S1'!L2","v":0}]
[null,"DEPARTMENT OF TRANSPORTATION",null,null,null,null,null,"PLANT CODE",null,{"$f":"'S1'!L3","v":0}]
[null,"PENNSYLVANIA TURNPIKE COMMISSION",null,null,null,null,null,"AGG SIZE",null,{"$f":"'S1'!L4","v":"Type 3B"}]
[{"$f":"'S1'!$A$5:$B$5","v":"Aggregate 2023"}]

{"sheet":"Chart 97-120","index":14,"n_rows":5,"n_cols":10,"rows_kept":5,"cut":false,"hidden":true,"merged":[[3,1,3,5],[3,7,3,8],[3,9,3,10],[4,0,4,1],[0,0,2,0],[1,1,1,5],[1,7,1,8],[1,9,1,10],[2,1,2,5],[2,7,2,8],[2,9,2,10]]}
[]
[null,"COMMONWEALTH OF PENNSYLVANIA",null,null,null,null,null,"DISTRICT",null,{"$f":"'S1'!L2","v":0}]
[null,"DEPARTMENT OF TRANSPORTATION",null,null,null,null,null,"PLANT CODE",null,{"$f":"'S1'!L3","v":0}]
[null,"PENNSYLVANIA TURNPIKE COMMISSION",null,null,null,null,null,"AGG SIZE",null,{"$f":"'S1'!L4","v":"Type 3B"}]
[{"$f":"'S1'!$A$5:$B$5","v":"Aggregate 2023"}]

{"sheet":"ST1","index":15,"n_rows":125,"n_cols":7,"rows_kept":125,"cut":false,"hidden":true,"merged":[]}
[]
[]
[]
["Samp #",200,100,8,4,0.25,0.375]
[]
[1,{"$f":"'S1'!$D$19","v":"  "},{"$f":"'S1'!$D$18","v":"  "},{"$f":"'S1'!$D$17","v":"  "},{"$f":"'S1'!$D$16","v":"  "},{"$f":"'S1'!$D$15","v":"  "},{"$f":"'S1'!$D$14","v":"  "}]
[2,{"$f":"'S1'!$F$19","v":"  "},{"$f":"'S1'!$F$18","v":"  "},{"$f":"'S1'!$F$17","v":"  "},{"$f":"'S1'!$F$16","v":"  "},{"$f":"'S1'!$F$15","v":"  "},{"$f":"'S1'!$F$14","v":"  "}]
[3,{"$f":"'S1'!$H$19","v":"  "},{"$f":"'S1'!$H$18","v":"  "},{"$f":"'S1'!$H$17","v":"  "},{"$f":"'S1'!$H$16","v":"  "},{"$f":"'S1'!$H$15","v":"  "},{"$f":"'S1'!$H$14","v":"  "}]
[4,{"$f":"'S1'!$J$19","v":"  "},{"$f":"'S1'!$J$18","v":"  "},{"$f":"'S1'!$J$17","v":"  "},{"$f":"'S1'!$J$16","v":"  "},{"$f":"'S1'!$J$15","v":"  "},{"$f":"'S1'!$J$14","v":"  "}]
[5,{"$f":"'S1'!$L$19","v":"  "},{"$f":"'S1'!$L$18","v":"  "},{"$f":"'S1'!$L$17","v":"  "},{"$f":"'S1'!$L$16","v":"  "},{"$f":"'S1'!$L$15","v":"  "},{"$f":"'S1'!$L$14","v":"  "}]
[6,{"$f":"'S1'!$N$19","v":"  "},{"$f":"'S1'!$N$18","v":"  "},{"$f":"'S1'!$N$17","v":"  "},{"$f":"'S1'!$N$16","v":"  "},{"$f":"'S1'!$N$15","v":"  "},{"$f":"'S1'!$N$14","v":"  "}]
[7,{"$f":"'S1'!$D$37","v":"  "},{"$f":"'S1'!$D$36","v":"  "},{"$f":"'S1'!$D$35","v":"  "},{"$f":"'S1'!$D$34","v":"  "},{"$f":"'S1'!$D$33","v":"  "},{"$f":"'S1'!$D$32","v":"  "}]
[8,{"$f":"'S1'!$F$37","v":"  "},{"$f":"'S1'!$F$36","v":"  "},{"$f":"'S1'!$F$35","v":"  "},{"$f":"'S1'!$F$34","v":"  "},{"$f":"'S1'!$F$33","v":"  "},{"$f":"'S1'!$F$32","v":"  "}]
[9,{"$f":"'S1'!$H$37","v":"  "},{"$f":"'S1'!$H$36","v":"  "},{"$f":"'S1'!$H$35","v":"  "},{"$f":"'S1'!$H$34","v":"  "},{"$f":"'S1'!$H$33","v":"  "},{"$f":"'S1'!$H$32","v":"  "}]
[10,{"$f":"'S1'!$J$37","v":"  "},{"$f":"'S1'!$J$36","v":"  "},{"$f":"'S1'!$J$35","v":"  "},{"$f":"'S1'!$J$34","v":"  "},{"$f":"'S1'!$J$33","v":"  "},{"$f":"'S1'!$J$32","v":"  "}]
[11,{"$f":"'S1'!$L$37","v":"  "},{"$f":"'S1'!$L$36","v":"  "},{"$f":"'S1'!$L$35","v":"  "},{"$f":"'S1'!$L$34","v":"  "},{"$f":"'S1'!$L$33","v":"  "},{"$f":"'S1'!$L$32","v":"  "}]
[12,{"$f":"'S1'!$N$37","v":"  "},{"$f":"'S1'!$N$36","v":"  "},{"$f":"'S1'!$N$35","v":"  "},{"$f":"'S1'!$N$34","v":"  "},{"$f":"'S1'!$N$33","v":"  "},{"$f":"'S1'!$N$32","v":"  "}]
[13,{"$f":"'S2'!$D$19","v":"  "},{"$f":"'S2'!$D$18","v":"  "},{"$f":"'S2'!$D$17","v":"  "},{"$f":"'S2'!$D$16","v":"  "},{"$f":"'S2'!$D$15","v":"  "},{"$f":"'S2'!$D$14","v":"  "}]
[14,{"$f":"'S2'!$F$19","v":"  "},{"$f":"'S2'!$F$18","v":"  "},{"$f":"'S2'!$F$17","v":"  "},{"$f":"'S2'!$F$16","v":"  "},{"$f":"'S2'!$F$15","v":"  "},{"$f":"'S2'!$F$14","v":"  "}]
[15,{"$f":"'S2'!$H$19","v":"  "},{"$f":"'S2'!$H$18","v":"  "},{"$f":"'S2'!$H$17","v":"  "},{"$f":"'S2'!$H$16","v":"  "},{"$f":"'S2'!$H$15","v":"  "},{"$f":"'S2'!$H$14","v":"  "}]
[16,{"$f":"'S2'!$J$19","v":"  "},{"$f":"'S2'!$J$18","v":"  "},{"$f":"'S2'!$J$17","v":"  "},{"$f":"'S2'!$J$16","v":"  "},{"$f":"'S2'!$J$15","v":"  "},{"$f":"'S2'!$J$14","v":"  "}]
[17,{"$f":"'S2'!$L$19","v":"  "},{"$f":"'S2'!$L$18","v":"  "},{"$f":"'S2'!$L$17","v":"  "},{"$f":"'S2'!$L$16","v":"  "},{"$f":"'S2'!$L$15","v":"  "},{"$f":"'S2'!$L$14","v":"  "}]
[18,{"$f":"'S2'!$N$19","v":"  "},{"$f":"'S2'!$N$18","v":"  "},{"$f":"'S2'!$N$17","v":"  "},{"$f":"'S2'!$N$16","v":"  "},{"$f":"'S2'!$N$15","v":"  "},{"$f":"'S2'!$N$14","v":"  "}]
[19,{"$f":"'S2'!$D$37","v":"  "},{"$f":"'S2'!$D$36","v":"  "},{"$f":"'S2'!$D$35","v":"  "},{"$f":"'S2'!$D$34","v":"  "},{"$f":"'S2'!$D$33","v":"  "},{"$f":"'S2'!$D$32","v":"  "}]
[20,{"$f":"'S2'!$F$37","v":"  "},{"$f":"'S2'!$F$36","v":"  "},{"$f":"'S2'!$F$35","v":"  "},{"$f":"'S2'!$F$34","v":"  "},{"$f":"'S2'!$F$33","v":"  "},{"$f":"'S2'!$F$32","v":"  "}]
[21,{"$f":"'S2'!$H$37","v":"  "},{"$f":"'S2'!$H$36","v":"  "},{"$f":"'S2'!$H$35","v":"  "},{"$f":"'S2'!$H$34","v":"  "},{"$f":"'S2'!$H$33","v":"  "},{"$f":"'S2'!$H$32","v":"  "}]
[22,{"$f":"'S2'!$J$37","v":"  "},{"$f":"'S2'!$J$36","v":"  "},{"$f":"'S2'!$J$35","v":"  "},{"$f":"'S2'!$J$34","v":"  "},{"$f":"'S2'!$J$33","v":"  "},{"$f":"'S2'!$J$32","v":"  "}]
[23,{"$f":"'S2'!$L$37","v":"  "},{"$f":"'S2'!$L$36","v":"  "},{"$f":"'S2'!$L$35","v":"  "},{"$f":"'S2'!$L$34","v":"  "},{"$f":"'S2'!$L$33","v":"  "},{"$f":"'S2'!$L$32","v":"  "}]
[24,{"$f":"'S2'!$N$37","v":"  "},{"$f":"'S2'!$N$36","v":"  "},{"$f":"'S2'!$N$35","v":"  "},{"$f":"'S2'!$N$34","v":"  "},{"$f":"'S2'!$N$33","v":"  "},{"$f":"'S2'!$N$32","v":"  "}]
[25,{"$f":"'S3'!$D$19","v":"  "},{"$f":"'S3'!$D$18","v":"  "},{"$f":"'S3'!$D$17","v":"  "},{"$f":"'S3'!$D$16","v":"  "},{"$f":"'S3'!$D$15","v":"  "},{"$f":"'S3'!$D$14","v":"  "}]
[26,{"$f":"'S3'!$F$19","v":"  "},{"$f":"'S3'!$F$18","v":"  "},{"$f":"'S3'!$F$17","v":"  "},{"$f":"'S3'!$F$16","v":"  "},{"$f":"'S3'!$F$15","v":"  "},{"$f":"'S3'!$F$14","v":"  "}]
[27,{"$f":"'S3'!$H$19","v":"  "},{"$f":"'S3'!$H$18","v":"  "},{"$f":"'S3'!$H$17","v":"  "},{"$f":"'S3'!$H$16","v":"  "},{"$f":"'S3'!$H$15","v":"  "},{"$f":"'S3'!$H$14","v":"  "}]
[28,{"$f":"'S3'!$J$19","v":"  "},{"$f":"'S3'!$J$18","v":"  "},{"$f":"'S3'!$J$17","v":"  "},{"$f":"'S3'!$J$16","v":"  "},{"$f":"'S3'!$J$15","v":"  "},{"$f":"'S3'!$J$14","v":"  "}]
[29,{"$f":"'S3'!$L$19","v":"  "},{"$f":"'S3'!$L$18","v":"  "},{"$f":"'S3'!$L$17","v":"  "},{"$f":"'S3'!$L$16","v":"  "},{"$f":"'S3'!$L$15","v":"  "},{"$f":"'S3'!$L$14","v":"  "}]
[30,{"$f":"'S3'!$N$19","v":"  "},{"$f":"'S3'!$N$18","v":"  "},{"$f":"'S3'!$N$17","v":"  "},{"$f":"'S3'!$N$16","v":"  "},{"$f":"'S3'!$N$15","v":"  "},{"$f":"'S3'!$N$14","v":"  "}]
[31,{"$f":"'S3'!$D$37","v":"  "},{"$f":"'S3'!$D$36","v":"  "},{"$f":"'S3'!$D$35","v":"  "},{"$f":"'S3'!$D$34","v":"  "},{"$f":"'S3'!$D$33","v":"  "},{"$f":"'S3'!$D$32","v":"  "}]
[32,{"$f":"'S3'!$F$37","v":"  "},{"$f":"'S3'!$F$36","v":"  "},{"$f":"'S3'!$F$35","v":"  "},{"$f":"'S3'!$F$34","v":"  "},{"$f":"'S3'!$F$33","v":"  "},{"$f":"'S3'!$F$32","v":"  "}]
[33,{"$f":"'S3'!$H$37","v":"  "},{"$f":"'S3'!$H$36","v":"  "},{"$f":"'S3'!$H$35","v":"  "},{"$f":"'S3'!$H$34","v":"  "},{"$f":"'S3'!$H$33","v":"  "},{"$f":"'S3'!$H$32","v":"  "}]
[34,{"$f":"'S3'!$J$37","v":"  "},{"$f":"'S3'!$J$36","v":"  "},{"$f":"'S3'!$J$35","v":"  "},{"$f":"'S3'!$J$34","v":"  "},{"$f":"'S3'!$J$33","v":"  "},{"$f":"'S3'!$J$32","v":"  "}]
[35,{"$f":"'S3'!$L$37","v":"  "},{"$f":"'S3'!$L$36","v":"  "},{"$f":"'S3'!$L$35","v":"  "},{"$f":"'S3'!$L$34","v":"  "},{"$f":"'S3'!$L$33","v":"  "},{"$f":"'S3'!$L$32","v":"  "}]
[36,{"$f":"'S3'!$N$37","v":"  "},{"$f":"'S3'!$N$36","v":"  "},{"$f":"'S3'!$N$35","v":"  "},{"$f":"'S3'!$N$34","v":"  "},{"$f":"'S3'!$N$33","v":"  "},{"$f":"'S3'!$N$32","v":"  "}]
[37,{"$f":"'S4'!$D$19","v":"  "},{"$f":"'S4'!$D$18","v":"  "},{"$f":"'S4'!$D$17","v":"  "},{"$f":"'S4'!$D$16","v":"  "},{"$f":"'S4'!$D$15","v":"  "},{"$f":"'S4'!$D$14","v":"  "}]
[38,{"$f":"'S4'!$F$19","v":"  "},{"$f":"'S4'!$F$18","v":"  "},{"$f":"'S4'!$F$17","v":"  "},{"$f":"'S4'!$F$16","v":"  "},{"$f":"'S4'!$F$15","v":"  "},{"$f":"'S4'!$F$14","v":"  "}]
[39,{"$f":"'S4'!$H$19","v":"  "},{"$f":"'S4'!$H$18","v":"  "},{"$f":"'S4'!$H$17","v":"  "},{"$f":"'S4'!$H$16","v":"  "},{"$f":"'S4'!$H$15","v":"  "},{"$f":"'S4'!$H$14","v":"  "}]
[40,{"$f":"'S4'!$J$19","v":"  "},{"$f":"'S4'!$J$18","v":"  "},{"$f":"'S4'!$J$17","v":"  "},{"$f":"'S4'!$J$16","v":"  "},{"$f":"'S4'!$J$15","v":"  "},{"$f":"'S4'!$J$14","v":"  "}]
[41,{"$f":"'S4'!$L$19","v":"  "},{"$f":"'S4'!$L$18","v":"  "},{"$f":"'S4'!$L$17","v":"  "},{"$f":"'S4'!$L$16","v":"  "},{"$f":"'S4'!$L$15","v":"  "},{"$f":"'S4'!$L$14","v":"  "}]
[42,{"$f":"'S4'!$N$19","v":"  "},{"$f":"'S4'!$N$18","v":"  "},{"$f":"'S4'!$N$17","v":"  "},{"$f":"'S4'!$N$16","v":"  "},{"$f":"'S4'!$N$15","v":"  "},{"$f":"'S4'!$N$14","v":"  "}]
[43,{"$f":"'S4'!$D$37","v":"  "},{"$f":"'S4'!$D$36","v":"  "},{"$f":"'S4'!$D$35","v":"  "},{"$f":"'S4'!$D$34","v":"  "},{"$f":"'S4'!$D$33","v":"  "},{"$f":"'S4'!$D$32","v":"  "}]
[44,{"$f":"'S4'!$F$37","v":"  "},{"$f":"'S4'!$F$36","v":"  "},{"$f":"'S4'!$F$35","v":"  "},{"$f":"'S4'!$F$34","v":"  "},{"$f":"'S4'!$F$33","v":"  "},{"$f":"'S4'!$F$32","v":"  "}]
[45,{"$f":"'S4'!$H$37","v":"  "},{"$f":"'S4'!$H$36","v":"  "},{"$f":"'S4'!$H$35","v":"  "},{"$f":"'S4'!$H$34","v":"  "},{"$f":"'S4'!$H$33","v":"  "},{"$f":"'S4'!$H$32","v":"  "}]
[46,{"$f":"'S4'!$J$37","v":"  "},{"$f":"'S4'!$J$36","v":"  "},{"$f":"'S4'!$J$35","v":"  "},{"$f":"'S4'!$J$34","v":"  "},{"$f":"'S4'!$J$33","v":"  "},{"$f":"'S4'!$J$32","v":"  "}]
[47,{"$f":"'S4'!$L$37","v":"  "},{"$f":"'S4'!$L$36","v":"  "},{"$f":"'S4'!$L$35","v":"  "},{"$f":"'S4'!$L$34","v":"  "},{"$f":"'S4'!$L$33","v":"  "},{"$f":"'S4'!$L$32","v":"  "}]
[48,{"$f":"'S4'!$N$37","v":"  "},{"$f":"'S4'!$N$36","v":"  "},{"$f":"'S4'!$N$35","v":"  "},{"$f":"'S4'!$N$34","v":"  "},{"$f":"'S4'!$N$33","v":"  "},{"$f":"'S4'!$N$32","v":"  "}]
[49,{"$f":"'S5'!$D$19","v":"  "},{"$f":"'S5'!$D$18","v":"  "},{"$f":"'S5'!$D$17","v":"  "},{"$f":"'S5'!$D$16","v":"  "},{"$f":"'S5'!$D$15","v":"  "},{"$f":"'S5'!$D$14","v":"  "}]
[50,{"$f":"'S5'!$F$19","v":"  "},{"$f":"'S5'!$F$18","v":"  "},{"$f":"'S5'!$F$17","v":"  "},{"$f":"'S5'!$F$16","v":"  "},{"$f":"'S5'!$F$15","v":"  "},{"$f":"'S5'!$F$14","v":"  "}]
[51,{"$f":"'S5'!$H$19","v":"  "},{"$f":"'S5'!$H$18","v":"  "},{"$f":"'S5'!$H$17","v":"  "},{"$f":"'S5'!$H$16","v":"  "},{"$f":"'S5'!$H$15","v":"  "},{"$f":"'S5'!$H$14","v":"  "}]
[52,{"$f":"'S5'!$J$19","v":"  "},{"$f":"'S5'!$J$18","v":"  "},{"$f":"'S5'!$J$17","v":"  "},{"$f":"'S5'!$J$16","v":"  "},{"$f":"'S5'!$J$15","v":"  "},{"$f":"'S5'!$J$14","v":"  "}]
[53,{"$f":"'S5'!$L$19","v":"  "},{"$f":"'S5'!$L$18","v":"  "},{"$f":"'S5'!$L$17","v":"  "},{"$f":"'S5'!$L$16","v":"  "},{"$f":"'S5'!$L$15","v":"  "},{"$f":"'S5'!$L$14","v":"  "}]
[54,{"$f":"'S5'!$N$19","v":"  "},{"$f":"'S5'!$N$18","v":"  "},{"$f":"'S5'!$N$17","v":"  "},{"$f":"'S5'!$N$16","v":"  "},{"$f":"'S5'!$N$15","v":"  "},{"$f":"'S5'!$N$14","v":"  "}]
[55,{"$f":"'S5'!$D$37","v":"  "},{"$f":"'S5'!$D$36","v":"  "},{"$f":"'S5'!$D$35","v":"  "},{"$f":"'S5'!$D$34","v":"  "},{"$f":"'S5'!$D$33","v":"  "},{"$f":"'S5'!$D$32","v":"  "}]
[56,{"$f":"'S5'!$F$37","v":"  "},{"$f":"'S5'!$F$36","v":"  "},{"$f":"'S5'!$F$35","v":"  "},{"$f":"'S5'!$F$34","v":"  "},{"$f":"'S5'!$F$33","v":"  "},{"$f":"'S5'!$F$32","v":"  "}]
[57,{"$f":"'S5'!$H$37","v":"  "},{"$f":"'S5'!$H$36","v":"  "},{"$f":"'S5'!$H$35","v":"  "},{"$f":"'S5'!$H$34","v":"  "},{"$f":"'S5'!$H$33","v":"  "},{"$f":"'S5'!$H$32","v":"  "}]
[58,{"$f":"'S5'!$J$37","v":"  "},{"$f":"'S5'!$J$36","v":"  "},{"$f":"'S5'!$J$35","v":"  "},{"$f":"'S5'!$J$34","v":"  "},{"$f":"'S5'!$J$33","v":"  "},{"$f":"'S5'!$J$32","v":"  "}]
[59,{"$f":"'S5'!$L$37","v":"  "},{"$f":"'S5'!$L$36","v":"  "},{"$f":"'S5'!$L$35","v":"  "},{"$f":"'S5'!$L$34","v":"  "},{"$f":"'S5'!$L$33","v":"  "},{"$f":"'S5'!$L$32","v":"  "}]
[60,{"$f":"'S5'!$N$37","v":"  "},{"$f":"'S5'!$N$36","v":"  "},{"$f":"'S5'!$N$35","v":"  "},{"$f":"'S5'!$N$34","v":"  "},{"$f":"'S5'!$N$33","v":"  "},{"$f":"'S5'!$N$32","v":"  "}]
[61,{"$f":"'S6'!$D$19","v":"  "},{"$f":"'S6'!$D$18","v":"  "},{"$f":"'S6'!$D$17","v":"  "},{"$f":"'S6'!$D$16","v":"  "},{"$f":"'S6'!$D$15","v":"  "},{"$f":"'S6'!$D$14","v":"  "}]
[62,{"$f":"'S6'!$F$19","v":"  "},{"$f":"'S6'!$F$18","v":"  "},{"$f":"'S6'!$F$17","v":"  "},{"$f":"'S6'!$F$16","v":"  "},{"$f":"'S6'!$F$15","v":"  "},{"$f":"'S6'!$F$14","v":"  "}]
[63,{"$f":"'S6'!$H$19","v":"  "},{"$f":"'S6'!$H$18","v":"  "},{"$f":"'S6'!$H$17","v":"  "},{"$f":"'S6'!$H$16","v":"  "},{"$f":"'S6'!$H$15","v":"  "},{"$f":"'S6'!$H$14","v":"  "}]
[64,{"$f":"'S6'!$J$19","v":"  "},{"$f":"'S6'!$J$18","v":"  "},{"$f":"'S6'!$J$17","v":"  "},{"$f":"'S6'!$J$16","v":"  "},{"$f":"'S6'!$J$15","v":"  "},{"$f":"'S6'!$J$14","v":"  "}]
[65,{"$f":"'S6'!$L$19","v":"  "},{"$f":"'S6'!$L$18","v":"  "},{"$f":"'S6'!$L$17","v":"  "},{"$f":"'S6'!$L$16","v":"  "},{"$f":"'S6'!$L$15","v":"  "},{"$f":"'S6'!$L$14","v":"  "}]
[66,{"$f":"'S6'!$N$19","v":"  "},{"$f":"'S6'!$N$18","v":"  "},{"$f":"'S6'!$N$17","v":"  "},{"$f":"'S6'!$N$16","v":"  "},{"$f":"'S6'!$N$15","v":"  "},{"$f":"'S6'!$N$14","v":"  "}]
[67,{"$f":"'S6'!$D$37","v":"  "},{"$f":"'S6'!$D$36","v":"  "},{"$f":"'S6'!$D$35","v":"  "},{"$f":"'S6'!$D$34","v":"  "},{"$f":"'S6'!$D$33","v":"  "},{"$f":"'S6'!$D$32","v":"  "}]
[68,{"$f":"'S6'!$F$37","v":"  "},{"$f":"'S6'!$F$36","v":"  "},{"$f":"'S6'!$F$35","v":"  "},{"$f":"'S6'!$F$34","v":"  "},{"$f":"'S6'!$F$33","v":"  "},{"$f":"'S6'!$F$32","v":"  "}]
[69,{"$f":"'S6'!$H$37","v":"  "},{"$f":"'S6'!$H$36","v":"  "},{"$f":"'S6'!$H$35","v":"  "},{"$f":"'S6'!$H$34","v":"  "},{"$f":"'S6'!$H$33","v":"  "},{"$f":"'S6'!$H$32","v":"  "}]
[70,{"$f":"'S6'!$J$37","v":"  "},{"$f":"'S6'!$J$36","v":"  "},{"$f":"'S6'!$J$35","v":"  "},{"$f":"'S6'!$J$34","v":"  "},{"$f":"'S6'!$J$33","v":"  "},{"$f":"'S6'!$J$32","v":"  "}]
[71,{"$f":"'S6'!$L$37","v":"  "},{"$f":"'S6'!$L$36","v":"  "},{"$f":"'S6'!$L$35","v":"  "},{"$f":"'S6'!$L$34","v":"  "},{"$f":"'S6'!$L$33","v":"  "},{"$f":"'S6'!$L$32","v":"  "}]
[72,{"$f":"'S6'!$N$37","v":"  "},{"$f":"'S6'!$N$36","v":"  "},{"$f":"'S6'!$N$35","v":"  "},{"$f":"'S6'!$N$34","v":"  "},{"$f":"'S6'!$N$33","v":"  "},{"$f":"'S6'!$N$32","v":"  "}]
[73,{"$f":"'S7'!$D$19","v":"  "},{"$f":"'S7'!$D$18","v":"  "},{"$f":"'S7'!$D$17","v":"  "},{"$f":"'S7'!$D$16","v":"  "},{"$f":"'S7'!$D$15","v":"  "},{"$f":"'S7'!$D$14","v":"  "}]
[74,{"$f":"'S7'!$F$19","v":"  "},{"$f":"'S7'!$F$18","v":"  "},{"$f":"'S7'!$F$17","v":"  "},{"$f":"'S7'!$F$16","v":"  "},{"$f":"'S7'!$F$15","v":"  "},{"$f":"'S7'!$F$14","v":"  "}]
[75,{"$f":"'S7'!$H$19","v":"  "},{"$f":"'S7'!$H$18","v":"  "},{"$f":"'S7'!$H$17","v":"  "},{"$f":"'S7'!$H$16","v":"  "},{"$f":"'S7'!$H$15","v":"  "},{"$f":"'S7'!$H$14","v":"  "}]
[76,{"$f":"'S7'!$J$19","v":"  "},{"$f":"'S7'!$J$18","v":"  "},{"$f":"'S7'!$J$17","v":"  "},{"$f":"'S7'!$J$16","v":"  "},{"$f":"'S7'!$J$15","v":"  "},{"$f":"'S7'!$J$14","v":"  "}]
[77,{"$f":"'S7'!$L$19","v":"  "},{"$f":"'S7'!$L$18","v":"  "},{"$f":"'S7'!$L$17","v":"  "},{"$f":"'S7'!$L$16","v":"  "},{"$f":"'S7'!$L$15","v":"  "},{"$f":"'S7'!$L$14","v":"  "}]
[78,{"$f":"'S7'!$N$19","v":"  "},{"$f":"'S7'!$N$18","v":"  "},{"$f":"'S7'!$N$17","v":"  "},{"$f":"'S7'!$N$16","v":"  "},{"$f":"'S7'!$N$15","v":"  "},{"$f":"'S7'!$N$14","v":"  "}]
[79,{"$f":"'S7'!$D$37","v":"  "},{"$f":"'S7'!$D$36","v":"  "},{"$f":"'S7'!$D$35","v":"  "},{"$f":"'S7'!$D$34","v":"  "},{"$f":"'S7'!$D$33","v":"  "},{"$f":"'S7'!$D$32","v":"  "}]
[80,{"$f":"'S7'!$F$37","v":"  "},{"$f":"'S7'!$F$36","v":"  "},{"$f":"'S7'!$F$35","v":"  "},{"$f":"'S7'!$F$34","v":"  "},{"$f":"'S7'!$F$33","v":"  "},{"$f":"'S7'!$F$32","v":"  "}]
[81,{"$f":"'S7'!$H$37","v":"  "},{"$f":"'S7'!$H$36","v":"  "},{"$f":"'S7'!$H$35","v":"  "},{"$f":"'S7'!$H$34","v":"  "},{"$f":"'S7'!$H$33","v":"  "},{"$f":"'S7'!$H$32","v":"  "}]
[82,{"$f":"'S7'!$J$37","v":"  "},{"$f":"'S7'!$J$36","v":"  "},{"$f":"'S7'!$J$35","v":"  "},{"$f":"'S7'!$J$34","v":"  "},{"$f":"'S7'!$J$33","v":"  "},{"$f":"'S7'!$J$32","v":"  "}]
[83,{"$f":"'S7'!$L$37","v":"  "},{"$f":"'S7'!$L$36","v":"  "},{"$f":"'S7'!$L$35","v":"  "},{"$f":"'S7'!$L$34","v":"  "},{"$f":"'S7'!$L$33","v":"  "},{"$f":"'S7'!$L$32","v":"  "}]
[84,{"$f":"'S7'!$N$37","v":"  "},{"$f":"'S7'!$N$36","v":"  "},{"$f":"'S7'!$N$35","v":"  "},{"$f":"'S7'!$N$34","v":"  "},{"$f":"'S7'!$N$33","v":"  "},{"$f":"'S7'!$N$32","v":"  "}]
[85,{"$f":"'S8'!$D$19","v":"  "},{"$f":"'S8'!$D$18","v":"  "},{"$f":"'S8'!$D$17","v":"  "},{"$f":"'S8'!$D$16","v":"  "},{"$f":"'S8'!$D$15","v":"  "},{"$f":"'S8'!$D$14","v":"  "}]
[86,{"$f":"'S8'!$F$19","v":"  "},{"$f":"'S8'!$F$18","v":"  "},{"$f":"'S8'!$F$17","v":"  "},{"$f":"'S8'!$F$16","v":"  "},{"$f":"'S8'!$F$15","v":"  "},{"$f":"'S8'!$F$14","v":"  "}]
[87,{"$f":"'S8'!$H$19","v":"  "},{"$f":"'S8'!$H$18","v":"  "},{"$f":"'S8'!$H$17","v":"  "},{"$f":"'S8'!$H$16","v":"  "},{"$f":"'S8'!$H$15","v":"  "},{"$f":"'S8'!$H$14","v":"  "}]
[88,{"$f":"'S8'!$J$19","v":"  "},{"$f":"'S8'!$J$18","v":"  "},{"$f":"'S8'!$J$17","v":"  "},{"$f":"'S8'!$J$16","v":"  "},{"$f":"'S8'!$J$15","v":"  "},{"$f":"'S8'!$J$14","v":"  "}]
[89,{"$f":"'S8'!$L$19","v":"  "},{"$f":"'S8'!$L$18","v":"  "},{"$f":"'S8'!$L$17","v":"  "},{"$f":"'S8'!$L$16","v":"  "},{"$f":"'S8'!$L$15","v":"  "},{"$f":"'S8'!$L$14","v":"  "}]
[90,{"$f":"'S8'!$N$19","v":"  "},{"$f":"'S8'!$N$18","v":"  "},{"$f":"'S8'!$N$17","v":"  "},{"$f":"'S8'!$N$16","v":"  "},{"$f":"'S8'!$N$15","v":"  "},{"$f":"'S8'!$N$14","v":"  "}]
[91,{"$f":"'S8'!$D$37","v":"  "},{"$f":"'S8'!$D$36","v":"  "},{"$f":"'S8'!$D$35","v":"  "},{"$f":"'S8'!$D$34","v":"  "},{"$f":"'S8'!$D$33","v":"  "},{"$f":"'S8'!$D$32","v":"  "}]
[92,{"$f":"'S8'!$F$37","v":"  "},{"$f":"'S8'!$F$36","v":"  "},{"$f":"'S8'!$F$35","v":"  "},{"$f":"'S8'!$F$34","v":"  "},{"$f":"'S8'!$F$33","v":"  "},{"$f":"'S8'!$F$32","v":"  "}]
[93,{"$f":"'S8'!$H$37","v":"  "},{"$f":"'S8'!$H$36","v":"  "},{"$f":"'S8'!$H$35","v":"  "},{"$f":"'S8'!$H$34","v":"  "},{"$f":"'S8'!$H$33","v":"  "},{"$f":"'S8'!$H$32","v":"  "}]
[94,{"$f":"'S8'!$J$37","v":"  "},{"$f":"'S8'!$J$36","v":"  "},{"$f":"'S8'!$J$35","v":"  "},{"$f":"'S8'!$J$34","v":"  "},{"$f":"'S8'!$J$33","v":"  "},{"$f":"'S8'!$J$32","v":"  "}]
[95,{"$f":"'S8'!$L$37","v":"  "},{"$f":"'S8'!$L$36","v":"  "},{"$f":"'S8'!$L$35","v":"  "},{"$f":"'S8'!$L$34","v":"  "},{"$f":"'S8'!$L$33","v":"  "},{"$f":"'S8'!$L$32","v":"  "}]
[96,{"$f":"'S8'!$N$37","v":"  "},{"$f":"'S8'!$N$36","v":"  "},{"$f":"'S8'!$N$35","v":"  "},{"$f":"'S8'!$N$34","v":"  "},{"$f":"'S8'!$N$33","v":"  "},{"$f":"'S8'!$N$32","v":"  "}]
[97,{"$f":"'S9'!$D$19","v":"  "},{"$f":"'S9'!$D$18","v":"  "},{"$f":"'S9'!$D$17","v":"  "},{"$f":"'S9'!$D$16","v":"  "},{"$f":"'S9'!$D$15","v":"  "},{"$f":"'S9'!$D$14","v":"  "}]
[98,{"$f":"'S9'!$F$19","v":"  "},{"$f":"'S9'!$F$18","v":"  "},{"$f":"'S9'!$F$17","v":"  "},{"$f":"'S9'!$F$16","v":"  "},{"$f":"'S9'!$F$15","v":"  "},{"$f":"'S9'!$F$14","v":"  "}]
[99,{"$f":"'S9'!$H$19","v":"  "},{"$f":"'S9'!$H$18","v":"  "},{"$f":"'S9'!$H$17","v":"  "},{"$f":"'S9'!$H$16","v":"  "},{"$f":"'S9'!$H$15","v":"  "},{"$f":"'S9'!$H$14","v":"  "}]
[100,{"$f":"'S9'!$J$19","v":"  "},{"$f":"'S9'!$J$18","v":"  "},{"$f":"'S9'!$J$17","v":"  "},{"$f":"'S9'!$J$16","v":"  "},{"$f":"'S9'!$J$15","v":"  "},{"$f":"'S9'!$J$14","v":"  "}]
[101,{"$f":"'S9'!$L$19","v":"  "},{"$f":"'S9'!$L$18","v":"  "},{"$f":"'S9'!$L$17","v":"  "},{"$f":"'S9'!$L$16","v":"  "},{"$f":"'S9'!$L$15","v":"  "},{"$f":"'S9'!$L$14","v":"  "}]
[102,{"$f":"'S9'!$N$19","v":"  "},{"$f":"'S9'!$N$18","v":"  "},{"$f":"'S9'!$N$17","v":"  "},{"$f":"'S9'!$N$16","v":"  "},{"$f":"'S9'!$N$15","v":"  "},{"$f":"'S9'!$N$14","v":"  "}]
[103,{"$f":"'S9'!$D$37","v":"  "},{"$f":"'S9'!$D$36","v":"  "},{"$f":"'S9'!$D$35","v":"  "},{"$f":"'S9'!$D$34","v":"  "},{"$f":"'S9'!$D$33","v":"  "},{"$f":"'S9'!$D$32","v":"  "}]
[104,{"$f":"'S9'!$F$37","v":"  "},{"$f":"'S9'!$F$36","v":"  "},{"$f":"'S9'!$F$35","v":"  "},{"$f":"'S9'!$F$34","v":"  "},{"$f":"'S9'!$F$33","v":"  "},{"$f":"'S9'!$F$32","v":"  "}]
[105,{"$f":"'S9'!$H$37","v":"  "},{"$f":"'S9'!$H$36","v":"  "},{"$f":"'S9'!$H$35","v":"  "},{"$f":"'S9'!$H$34","v":"  "},{"$f":"'S9'!$H$33","v":"  "},{"$f":"'S9'!$H$32","v":"  "}]
[106,{"$f":"'S9'!$J$37","v":"  "},{"$f":"'S9'!$J$36","v":"  "},{"$f":"'S9'!$J$35","v":"  "},{"$f":"'S9'!$J$34","v":"  "},{"$f":"'S9'!$J$33","v":"  "},{"$f":"'S9'!$J$32","v":"  "}]
[107,{"$f":"'S9'!$L$37","v":"  "},{"$f":"'S9'!$L$36","v":"  "},{"$f":"'S9'!$L$35","v":"  "},{"$f":"'S9'!$L$34","v":"  "},{"$f":"'S9'!$L$33","v":"  "},{"$f":"'S9'!$L$32","v":"  "}]
[108,{"$f":"'S9'!$N$37","v":"  "},{"$f":"'S9'!$N$36","v":"  "},{"$f":"'S9'!$N$35","v":"  "},{"$f":"'S9'!$N$34","v":"  "},{"$f":"'S9'!$N$33","v":"  "},{"$f":"'S9'!$N$32","v":"  "}]
[109,{"$f":"'S10'!$D$19","v":"  "},{"$f":"'S10'!$D$18","v":"  "},{"$f":"'S10'!$D$17","v":"  "},{"$f":"'S10'!$D$16","v":"  "},{"$f":"'S10'!$D$15","v":"  "},{"$f":"'S10'!$D$14","v":"  "}]
[110,{"$f":"'S10'!$F$19","v":"  "},{"$f":"'S10'!$F$18","v":"  "},{"$f":"'S10'!$F$17","v":"  "},{"$f":"'S10'!$F$16","v":"  "},{"$f":"'S10'!$F$15","v":"  "},{"$f":"'S10'!$F$14","v":"  "}]
[111,{"$f":"'S10'!$H$19","v":"  "},{"$f":"'S10'!$H$18","v":"  "},{"$f":"'S10'!$H$17","v":"  "},{"$f":"'S10'!$H$16","v":"  "},{"$f":"'S10'!$H$15","v":"  "},{"$f":"'S10'!$H$14","v":"  "}]
[112,{"$f":"'S10'!$J$19","v":"  "},{"$f":"'S10'!$J$18","v":"  "},{"$f":"'S10'!$J$17","v":"  "},{"$f":"'S10'!$J$16","v":"  "},{"$f":"'S10'!$J$15","v":"  "},{"$f":"'S10'!$J$14","v":"  "}]
[113,{"$f":"'S10'!$L$19","v":"  "},{"$f":"'S10'!$L$18","v":"  "},{"$f":"'S10'!$L$17","v":"  "},{"$f":"'S10'!$L$16","v":"  "},{"$f":"'S10'!$L$15","v":"  "},{"$f":"'S10'!$L$14","v":"  "}]
[114,{"$f":"'S10'!$N$19","v":"  "},{"$f":"'S10'!$N$18","v":"  "},{"$f":"'S10'!$N$17","v":"  "},{"$f":"'S10'!$N$16","v":"  "},{"$f":"'S10'!$N$15","v":"  "},{"$f":"'S10'!$N$14","v":"  "}]
[115,{"$f":"'S10'!$D$37","v":"  "},{"$f":"'S10'!$D$36","v":"  "},{"$f":"'S10'!$D$35","v":"  "},{"$f":"'S10'!$D$34","v":"  "},{"$f":"'S10'!$D$33","v":"  "},{"$f":"'S10'!$D$32","v":"  "}]
[116,{"$f":"'S10'!$F$37","v":"  "},{"$f":"'S10'!$F$36","v":"  "},{"$f":"'S10'!$F$35","v":"  "},{"$f":"'S10'!$F$34","v":"  "},{"$f":"'S10'!$F$33","v":"  "},{"$f":"'S10'!$F$32","v":"  "}]
[117,{"$f":"'S10'!$H$37","v":"  "},{"$f":"'S10'!$H$36","v":"  "},{"$f":"'S10'!$H$35","v":"  "},{"$f":"'S10'!$H$34","v":"  "},{"$f":"'S10'!$H$33","v":"  "},{"$f":"'S10'!$H$32","v":"  "}]
[118,{"$f":"'S10'!$J$37","v":"  "},{"$f":"'S10'!$J$36","v":"  "},{"$f":"'S10'!$J$35","v":"  "},{"$f":"'S10'!$J$34","v":"  "},{"$f":"'S10'!$J$33","v":"  "},{"$f":"'S10'!$J$32","v":"  "}]
[119,{"$f":"'S10'!$L$37","v":"  "},{"$f":"'S10'!$L$36","v":"  "},{"$f":"'S10'!$L$35","v":"  "},{"$f":"'S10'!$L$34","v":"  "},{"$f":"'S10'!$L$33","v":"  "},{"$f":"'S10'!$L$32","v":"  "}]
[120,{"$f":"'S10'!$N$37","v":"  "},{"$f":"'S10'!$N$36","v":"  "},{"$f":"'S10'!$N$35","v":"  "},{"$f":"'S10'!$N$34","v":"  "},{"$f":"'S10'!$N$33","v":"  "},{"$f":"'S10'!$N$32","v":"  "}]

{"sheet":"Avg","index":16,"n_rows":7,"n_cols":8,"rows_kept":7,"cut":false,"hidden":false,"merged":[[1,0,1,6],[1,7,1,8]]}
[]
["Average Gradations",null,null,null,null,null,null,{"$f":"IF(ISBLANK('S1'!L4),\" \",'S1'!L4)","v":"Type 3B"}]
[]
["Sieve",200,100,8,4,0.25,0.375]
["Count",{"$f":"COUNT('ST1'!B6:B125)","v":0},{"$f":"COUNT('ST1'!C6:C125)","v":0},{"$f":"COUNT('ST1'!D6:D125)","v":0},{"$f":"COUNT('ST1'!E6:E125)","v":0},{"$f":"COUNT('ST1'!F6:F125)","v":0},{"$f":"COUNT('ST1'!G6:G125)","v":0}]
["Avg",{"$f":"AVERAGE('ST1'!B6:B125)","v":{"$error":"#DIV/0!"}},{"$f":"AVERAGE('ST1'!C6:C125)","v":{"$error":"#DIV/0!"}},{"$f":"AVERAGE('ST1'!D6:D125)","v":{"$error":"#DIV/0!"}},{"$f":"AVERAGE('ST1'!E6:E125)","v":{"$error":"#DIV/0!"}},{"$f":"AVERAGE('ST1'!F6:F125)","v":{"$error":"#DIV/0!"}},{"$f":"AVERAGE('ST1'!G6:G125)","v":{"$error":"#DIV/0!"}}]
["St Dev",{"$f":"STDEV('ST1'!B6:B125)","v":{"$error":"#DIV/0!"}},{"$f":"STDEV('ST1'!C6:C125)","v":{"$error":"#DIV/0!"}},{"$f":"STDEV('ST1'!D6:D125)","v":{"$error":"#DIV/0!"}},{"$f":"STDEV('ST1'!E6:E125)","v":{"$error":"#DIV/0!"}},{"$f":"STDEV('ST1'!F6:F125)","v":{"$error":"#DIV/0!"}},{"$f":"STDEV('ST1'!G6:G125)","v":{"$error":"#DIV/0!"}}]

{"sheet":"ST13","index":17,"n_rows":122,"n_cols":16,"rows_kept":122,"cut":false,"hidden":true,"merged":[[0,1,0,2],[0,3,0,4],[0,5,0,6],[0,7,0,8],[0,9,0,10]]}
["Sam. No.",0.375,null,4,null,8,null,100,null,200,null,null,null,null,null,{"$f":"'S1'!L4","v":"Type 3B"}]
[null,"N=1","N=3","N=1","N=3","N=1","N=3","N=1","N=3","N=1","N=3"]
[{"$f":"IF(ISBLANK('S1'!C$8),\" \",'S1'!C$8)","v":" "},{"$f":"IF(ISTEXT('S1'!$D$14),NA(),'S1'!$D$14)","v":{"$error":"#N/A"}},null,{"$f":"IF(ISTEXT('S1'!$D$16),NA(),'S1'!$D$16)","v":{"$error":"#N/A"}},null,{"$f":"IF(ISTEXT('S1'!$D$17),NA(),'S1'!$D$17)","v":{"$error":"#N/A"}},null,{"$f":"IF(ISTEXT('S1'!$D$18),NA(),'S1'!$D$18)","v":{"$error":"#N/A"}},null,{"$f":"IF(ISTEXT('S1'!$D$19),NA(),'S1'!$D$19)","v":{"$error":"#N/A"}}]
[{"$f":"IF(ISBLANK('S1'!E$8),\" \",'S1'!E$8)","v":" "},{"$f":"IF(ISTEXT('S1'!$F$14),NA(),'S1'!$F$14)","v":{"$error":"#N/A"}},null,{"$f":"IF(ISTEXT('S1'!$F$16),NA(),'S1'!$F$16)","v":{"$error":"#N/A"}},null,{"$f":"IF(ISTEXT('S1'!$F$17),NA(),'S1'!$F$17)","v":{"$error":"#N/A"}},null,{"$f":"IF(ISTEXT('S1'!$F$18),NA(),'S1'!$F$18)","v":{"$error":"#N/A"}},null,{"$f":"IF(ISTEXT('S1'!$F$19),NA(),'S1'!$F$19)","v":{"$error":"#N/A"}}]
[{"$f":"IF(ISBLANK('S1'!G$8),\" \",'S1'!G$8)","v":" "},{"$f":"IF(ISTEXT('S1'!$H$14),NA(),'S1'!$H$14)","v":{"$error":"#N/A"}},null,{"$f":"IF(ISTEXT('S1'!$H$16),NA(),'S1'!$H$16)","v":{"$error":"#N/A"}},null,{"$f":"IF(ISTEXT('S1'!$H$17),NA(),'S1'!$H$17)","v":{"$error":"#N/A"}},null,{"$f":"IF(ISTEXT('S1'!$H$18),NA(),'S1'!$H$18)","v":{"$error":"#N/A"}},null,{"$f":"IF(ISTEXT('S1'!$H$19),NA(),'S1'!$H$19)","v":{"$error":"#N/A"}}]
[{"$f":"IF(ISBLANK('S1'!I$8),\" \",'S1'!I$8)","v":" "},{"$f":"IF(ISTEXT('S1'!$J$14),NA(),'S1'!$J$14)","v":{"$error":"#N/A"}},null,{"$f":"IF(ISTEXT('S1'!$J$16),NA(),'S1'!$J$16)","v":{"$error":"#N/A"}},null,{"$f":"IF(ISTEXT('S1'!$J$17),NA(),'S1'!$J$17)","v":{"$error":"#N/A"}},null,{"$f":"IF(ISTEXT('S1'!$J$18),NA(),'S1'!$J$18)","v":{"$error":"#N/A"}},null,{"$f":"IF(ISTEXT('S1'!$J$19),NA(),'S1'!$J$19)","v":{"$error":"#N/A"}}]
[{"$f":"IF(ISBLANK('S1'!K$8),\" \",'S1'!K$8)","v":" "},{"$f":"IF(ISTEXT('S1'!$L$14),NA(),'S1'!$L$14)","v":{"$error":"#N/A"}},null,{"$f":"IF(ISTEXT('S1'!$L$16),NA(),'S1'!$L$16)","v":{"$error":"#N/A"}},null,{"$f":"IF(ISTEXT('S1'!$L$17),NA(),'S1'!$L$17)","v":{"$error":"#N/A"}},null,{"$f":"IF(ISTEXT('S1'!$L$18),NA(),'S1'!$L$18)","v":{"$error":"#N/A"}},null,{"$f":"IF(ISTEXT('S1'!$L$19),NA(),'S1'!$L$19)","v":{"$error":"#N/A"}}]
[{"$f":"IF(ISBLANK('S1'!M$8),\" \",'S1'!M$8)","v":" "},{"$f":"IF(ISTEXT('S1'!$N$14),NA(),'S1'!$N$14)","v":{"$error":"#N/A"}},null,{"$f":"IF(ISTEXT('S1'!$N$16),NA(),'S1'!$N$16)","v":{"$error":"#N/A"}},null,{"$f":"IF(ISTEXT('S1'!$N$17),NA(),'S1'!$N$17)","v":{"$error":"#N/A"}},null,{"$f":"IF(ISTEXT('S1'!$N$18),NA(),'S1'!$N$18)","v":{"$error":"#N/A"}},null,{"$f":"IF(ISTEXT('S1'!$N$19),NA(),'S1'!$N$19)","v":{"$error":"#N/A"}}]
[{"$f":"IF(ISBLANK('S1'!C$26),\" \",'S1'!C$26)","v":" "},{"$f":"IF(ISTEXT('S1'!$D$32),NA(),'S1'!$D$32)","v":{"$error":"#N/A"}},null,{"$f":"IF(ISTEXT('S1'!$D$34),NA(),'S1'!$D$34)","v":{"$error":"#N/A"}},null,{"$f":"IF(ISTEXT('S1'!$D$35),NA(),'S1'!$D$35)","v":{"$error":"#N/A"}},null,{"$f":"IF(ISTEXT('S1'!$D$36),NA(),'S1'!$D$36)","v":{"$error":"#N/A"}},null,{"$f":"IF(ISTEXT('S1'!$D$37),NA(),'S1'!$D$37)","v":{"$error":"#N/A"}}]
[{"$f":"IF(ISBLANK('S1'!E$26),\" \",'S1'!E$26)","v":" "},{"$f":"IF(ISTEXT('S1'!$F$32),NA(),'S1'!$F$32)","v":{"$error":"#N/A"}},null,{"$f":"IF(ISTEXT('S1'!$F$34),NA(),'S1'!$F$34)","v":{"$error":"#N/A"}},null,{"$f":"IF(ISTEXT('S1'!$F$35),NA(),'S1'!$F$35)","v":{"$error":"#N/A"}},null,{"$f":"IF(ISTEXT('S1'!$F$36),NA(),'S1'!$F$36)","v":{"$error":"#N/A"}},null,{"$f":"IF(ISTEXT('S1'!$F$37),NA(),'S1'!$F$37)","v":{"$error":"#N/A"}}]
[{"$f":"IF(ISBLANK('S1'!G$26),\" \",'S1'!G$26)","v":" "},{"$f":"IF(ISTEXT('S1'!$H$32),NA(),'S1'!$H$32)","v":{"$error":"#N/A"}},null,{"$f":"IF(ISTEXT('S1'!$H$34),NA(),'S1'!$H$34)","v":{"$error":"#N/A"}},null,{"$f":"IF(ISTEXT('S1'!$H$35),NA(),'S1'!$H$35)","v":{"$error":"#N/A"}},null,{"$f":"IF(ISTEXT('S1'!$H$36),NA(),'S1'!$H$36)","v":{"$error":"#N/A"}},null,{"$f":"IF(ISTEXT('S1'!$H$37),NA(),'S1'!$H$37)","v":{"$error":"#N/A"}}]
[{"$f":"IF(ISBLANK('S1'!I$26),\" \",'S1'!I$26)","v":" "},{"$f":"IF(ISTEXT('S1'!$J$32),NA(),'S1'!$J$32)","v":{"$error":"#N/A"}},null,{"$f":"IF(ISTEXT('S1'!$J$34),NA(),'S1'!$J$34)","v":{"$error":"#N/A"}},null,{"$f":"IF(ISTEXT('S1'!$J$35),NA(),'S1'!$J$35)","v":{"$error":"#N/A"}},null,{"$f":"IF(ISTEXT('S1'!$J$36),NA(),'S1'!$J$36)","v":{"$error":"#N/A"}},null,{"$f":"IF(ISTEXT('S1'!$J$37),NA(),'S1'!$J$37)","v":{"$error":"#N/A"}}]
[{"$f":"IF(ISBLANK('S1'!K$26),\" \",'S1'!K$26)","v":" "},{"$f":"IF(ISTEXT('S1'!$L$32),NA(),'S1'!$L$32)","v":{"$error":"#N/A"}},null,{"$f":"IF(ISTEXT('S1'!$L$34),NA(),'S1'!$L$34)","v":{"$error":"#N/A"}},null,{"$f":"IF(ISTEXT('S1'!$L$35),NA(),'S1'!$L$35)","v":{"$error":"#N/A"}},null,{"$f":"IF(ISTEXT('S1'!$L$36),NA(),'S1'!$L$36)","v":{"$error":"#N/A"}},null,{"$f":"IF(ISTEXT('S1'!$L$37),NA(),'S1'!$L$37)","v":{"$error":"#N/A"}}]
[{"$f":"IF(ISBLANK('S1'!M$26),\" \",'S1'!M$26)","v":" "},{"$f":"IF(ISTEXT('S1'!$N$32),NA(),'S1'!$N$32)","v":{"$error":"#N/A"}},null,{"$f":"IF(ISTEXT('S1'!$N$34),NA(),'S1'!$N$34)","v":{"$error":"#N/A"}},null,{"$f":"IF(ISTEXT('S1'!$N$35),NA(),'S1'!$N$35)","v":{"$error":"#N/A"}},null,{"$f":"IF(ISTEXT('S1'!$N$36),NA(),'S1'!$N$36)","v":{"$error":"#N/A"}},null,{"$f":"IF(ISTEXT('S1'!$N$37),NA(),'S1'!$N$37)","v":{"$error":"#N/A"}}]
[{"$f":"IF(ISBLANK('S2'!C$8),\" \",'S2'!C$8)","v":" "},{"$f":"IF(ISTEXT('S2'!$D$14),NA(),'S2'!$D$14)","v":{"$error":"#N/A"}},null,{"$f":"IF(ISTEXT('S2'!$D$16),NA(),'S2'!$D$16)","v":{"$error":"#N/A"}},null,{"$f":"IF(ISTEXT('S2'!$D$17),NA(),'S2'!$D$17)","v":{"$error":"#N/A"}},null,{"$f":"IF(ISTEXT('S2'!$D$18),NA(),'S2'!$D$18)","v":{"$error":"#N/A"}},null,{"$f":"IF(ISTEXT('S2'!$D$19),NA(),'S2'!$D$19)","v":{"$error":"#N/A"}}]
[{"$f":"IF(ISBLANK('S2'!E$8),\" \",'S2'!E$8)","v":" "},{"$f":"IF(ISTEXT('S2'!$F$14),NA(),'S2'!$F$14)","v":{"$error":"#N/A"}},null,{"$f":"IF(ISTEXT('S2'!$F$16),NA(),'S2'!$F$16)","v":{"$error":"#N/A"}},null,{"$f":"IF(ISTEXT('S2'!$F$17),NA(),'S2'!$F$17)","v":{"$error":"#N/A"}},null,{"$f":"IF(ISTEXT('S2'!$F$18),NA(),'S2'!$F$18)","v":{"$error":"#N/A"}},null,{"$f":"IF(ISTEXT('S2'!$F$19),NA(),'S2'!$F$19)","v":{"$error":"#N/A"}}]
[{"$f":"IF(ISBLANK('S2'!G$8),\" \",'S2'!G$8)","v":" "},{"$f":"IF(ISTEXT('S2'!$H$14),NA(),'S2'!$H$14)","v":{"$error":"#N/A"}},null,{"$f":"IF(ISTEXT('S2'!$H$16),NA(),'S2'!$H$16)","v":{"$error":"#N/A"}},null,{"$f":"IF(ISTEXT('S2'!$H$17),NA(),'S2'!$H$17)","v":{"$error":"#N/A"}},null,{"$f":"IF(ISTEXT('S2'!$H$18),NA(),'S2'!$H$18)","v":{"$error":"#N/A"}},null,{"$f":"IF(ISTEXT('S2'!$H$19),NA(),'S2'!$H$19)","v":{"$error":"#N/A"}}]
[{"$f":"IF(ISBLANK('S2'!I$8),\" \",'S2'!I$8)","v":" "},{"$f":"IF(ISTEXT('S2'!$J$14),NA(),'S2'!$J$14)","v":{"$error":"#N/A"}},null,{"$f":"IF(ISTEXT('S2'!$J$16),NA(),'S2'!$J$16)","v":{"$error":"#N/A"}},null,{"$f":"IF(ISTEXT('S2'!$J$17),NA(),'S2'!$J$17)","v":{"$error":"#N/A"}},null,{"$f":"IF(ISTEXT('S2'!$J$18),NA(),'S2'!$J$18)","v":{"$error":"#N/A"}},null,{"$f":"IF(ISTEXT('S2'!$J$19),NA(),'S2'!$J$19)","v":{"$error":"#N/A"}}]
[{"$f":"IF(ISBLANK('S2'!K$8),\" \",'S2'!K$8)","v":" "},{"$f":"IF(ISTEXT('S2'!$L$14),NA(),'S2'!$L$14)","v":{"$error":"#N/A"}},null,{"$f":"IF(ISTEXT('S2'!$L$16),NA(),'S2'!$L$16)","v":{"$error":"#N/A"}},null,{"$f":"IF(ISTEXT('S2'!$L$17),NA(),'S2'!$L$17)","v":{"$error":"#N/A"}},null,{"$f":"IF(ISTEXT('S2'!$L$18),NA(),'S2'!$L$18)","v":{"$error":"#N/A"}},null,{"$f":"IF(ISTEXT('S2'!$L$19),NA(),'S2'!$L$19)","v":{"$error":"#N/A"}}]
[{"$f":"IF(ISBLANK('S2'!M$8),\" \",'S2'!M$8)","v":" "},{"$f":"IF(ISTEXT('S2'!$N$14),NA(),'S2'!$N$14)","v":{"$error":"#N/A"}},null,{"$f":"IF(ISTEXT('S2'!$N$16),NA(),'S2'!$N$16)","v":{"$error":"#N/A"}},null,{"$f":"IF(ISTEXT('S2'!$N$17),NA(),'S2'!$N$17)","v":{"$error":"#N/A"}},null,{"$f":"IF(ISTEXT('S2'!$N$18),NA(),'S2'!$N$18)","v":{"$error":"#N/A"}},null,{"$f":"IF(ISTEXT('S2'!$N$19),NA(),'S2'!$N$19)","v":{"$error":"#N/A"}}]
[{"$f":"IF(ISBLANK('S2'!C$26),\" \",'S2'!C$26)","v":" "},{"$f":"IF(ISTEXT('S2'!$D$32),NA(),'S2'!$D$32)","v":{"$error":"#N/A"}},null,{"$f":"IF(ISTEXT('S2'!$D$34),NA(),'S2'!$D$34)","v":{"$error":"#N/A"}},null,{"$f":"IF(ISTEXT('S2'!$D$35),NA(),'S2'!$D$35)","v":{"$error":"#N/A"}},null,{"$f":"IF(ISTEXT('S2'!$D$36),NA(),'S2'!$D$36)","v":{"$error":"#N/A"}},null,{"$f":"IF(ISTEXT('S2'!$D$37),NA(),'S2'!$D$37)","v":{"$error":"#N/A"}}]
[{"$f":"IF(ISBLANK('S2'!E$26),\" \",'S2'!E$26)","v":" "},{"$f":"IF(ISTEXT('S2'!$F$32),NA(),'S2'!$F$32)","v":{"$error":"#N/A"}},null,{"$f":"IF(ISTEXT('S2'!$F$34),NA(),'S2'!$F$34)","v":{"$error":"#N/A"}},null,{"$f":"IF(ISTEXT('S2'!$F$35),NA(),'S2'!$F$35)","v":{"$error":"#N/A"}},null,{"$f":"IF(ISTEXT('S2'!$F$36),NA(),'S2'!$F$36)","v":{"$error":"#N/A"}},null,{"$f":"IF(ISTEXT('S2'!$F$37),NA(),'S2'!$F$37)","v":{"$error":"#N/A"}}]
[{"$f":"IF(ISBLANK('S2'!G$26),\" \",'S2'!G$26)","v":" "},{"$f":"IF(ISTEXT('S2'!$H$32),NA(),'S2'!$H$32)","v":{"$error":"#N/A"}},null,{"$f":"IF(ISTEXT('S2'!$H$34),NA(),'S2'!$H$34)","v":{"$error":"#N/A"}},null,{"$f":"IF(ISTEXT('S2'!$H$35),NA(),'S2'!$H$35)","v":{"$error":"#N/A"}},null,{"$f":"IF(ISTEXT('S2'!$H$36),NA(),'S2'!$H$36)","v":{"$error":"#N/A"}},null,{"$f":"IF(ISTEXT('S2'!$H$37),NA(),'S2'!$H$37)","v":{"$error":"#N/A"}}]
[{"$f":"IF(ISBLANK('S2'!I$26),\" \",'S2'!I$26)","v":" "},{"$f":"IF(ISTEXT('S2'!$J$32),NA(),'S2'!$J$32)","v":{"$error":"#N/A"}},null,{"$f":"IF(ISTEXT('S2'!$J$34),NA(),'S2'!$J$34)","v":{"$error":"#N/A"}},null,{"$f":"IF(ISTEXT('S2'!$J$35),NA(),'S2'!$J$35)","v":{"$error":"#N/A"}},null,{"$f":"IF(ISTEXT('S2'!$J$36),NA(),'S2'!$J$36)","v":{"$error":"#N/A"}},null,{"$f":"IF(ISTEXT('S2'!$J$37),NA(),'S2'!$J$37)","v":{"$error":"#N/A"}}]
[{"$f":"IF(ISBLANK('S2'!K$26),\" \",'S2'!K$26)","v":" "},{"$f":"IF(ISTEXT('S2'!$L$32),NA(),'S2'!$L$32)","v":{"$error":"#N/A"}},null,{"$f":"IF(ISTEXT('S2'!$L$34),NA(),'S2'!$L$34)","v":{"$error":"#N/A"}},null,{"$f":"IF(ISTEXT('S2'!$L$35),NA(),'S2'!$L$35)","v":{"$error":"#N/A"}},null,{"$f":"IF(ISTEXT('S2'!$L$36),NA(),'S2'!$L$36)","v":{"$error":"#N/A"}},null,{"$f":"IF(ISTEXT('S2'!$L$37),NA(),'S2'!$L$37)","v":{"$error":"#N/A"}}]
[{"$f":"IF(ISBLANK('S2'!M$26),\" \",'S2'!M$26)","v":" "},{"$f":"IF(ISTEXT('S2'!$N$32),NA(),'S2'!$N$32)","v":{"$error":"#N/A"}},null,{"$f":"IF(ISTEXT('S2'!$N$34),NA(),'S2'!$N$34)","v":{"$error":"#N/A"}},null,{"$f":"IF(ISTEXT('S2'!$N$35),NA(),'S2'!$N$35)","v":{"$error":"#N/A"}},null,{"$f":"IF(ISTEXT('S2'!$N$36),NA(),'S2'!$N$36)","v":{"$error":"#N/A"}},null,{"$f":"IF(ISTEXT('S2'!$N$37),NA(),'S2'!$N$37)","v":{"$error":"#N/A"}}]
[{"$f":"IF(ISBLANK('S3'!C$8),\" \",'S3'!C$8)","v":" "},{"$f":"IF(ISTEXT('S3'!$D$14),NA(),'S3'!$D$14)","v":{"$error":"#N/A"}},null,{"$f":"IF(ISTEXT('S3'!$D$16),NA(),'S3'!$D$16)","v":{"$error":"#N/A"}},null,{"$f":"IF(ISTEXT('S3'!$D$17),NA(),'S3'!$D$17)","v":{"$error":"#N/A"}},null,{"$f":"IF(ISTEXT('S3'!$D$18),NA(),'S3'!$D$18)","v":{"$error":"#N/A"}},null,{"$f":"IF(ISTEXT('S3'!$D$19),NA(),'S3'!$D$19)","v":{"$error":"#N/A"}}]
[{"$f":"IF(ISBLANK('S3'!E$8),\" \",'S3'!E$8)","v":" "},{"$f":"IF(ISTEXT('S3'!$F$14),NA(),'S3'!$F$14)","v":{"$error":"#N/A"}},null,{"$f":"IF(ISTEXT('S3'!$F$16),NA(),'S3'!$F$16)","v":{"$error":"#N/A"}},null,{"$f":"IF(ISTEXT('S3'!$F$17),NA(),'S3'!$F$17)","v":{"$error":"#N/A"}},null,{"$f":"IF(ISTEXT('S3'!$F$18),NA(),'S3'!$F$18)","v":{"$error":"#N/A"}},null,{"$f":"IF(ISTEXT('S3'!$F$19),NA(),'S3'!$F$19)","v":{"$error":"#N/A"}}]
[{"$f":"IF(ISBLANK('S3'!G$8),\" \",'S3'!G$8)","v":" "},{"$f":"IF(ISTEXT('S3'!$H$14),NA(),'S3'!$H$14)","v":{"$error":"#N/A"}},null,{"$f":"IF(ISTEXT('S3'!$H$16),NA(),'S3'!$H$16)","v":{"$error":"#N/A"}},null,{"$f":"IF(ISTEXT('S3'!$H$17),NA(),'S3'!$H$17)","v":{"$error":"#N/A"}},null,{"$f":"IF(ISTEXT('S3'!$H$18),NA(),'S3'!$H$18)","v":{"$error":"#N/A"}},null,{"$f":"IF(ISTEXT('S3'!$H$19),NA(),'S3'!$H$19)","v":{"$error":"#N/A"}}]
[{"$f":"IF(ISBLANK('S3'!I$8),\" \",'S3'!I$8)","v":" "},{"$f":"IF(ISTEXT('S3'!$J$14),NA(),'S3'!$J$14)","v":{"$error":"#N/A"}},null,{"$f":"IF(ISTEXT('S3'!$J$16),NA(),'S3'!$J$16)","v":{"$error":"#N/A"}},null,{"$f":"IF(ISTEXT('S3'!$J$17),NA(),'S3'!$J$17)","v":{"$error":"#N/A"}},null,{"$f":"IF(ISTEXT('S3'!$J$18),NA(),'S3'!$J$18)","v":{"$error":"#N/A"}},null,{"$f":"IF(ISTEXT('S3'!$J$19),NA(),'S3'!$J$19)","v":{"$error":"#N/A"}}]
[{"$f":"IF(ISBLANK('S3'!K$8),\" \",'S3'!K$8)","v":" "},{"$f":"IF(ISTEXT('S3'!$L$14),NA(),'S3'!$L$14)","v":{"$error":"#N/A"}},null,{"$f":"IF(ISTEXT('S3'!$L$16),NA(),'S3'!$L$16)","v":{"$error":"#N/A"}},null,{"$f":"IF(ISTEXT('S3'!$L$17),NA(),'S3'!$L$17)","v":{"$error":"#N/A"}},null,{"$f":"IF(ISTEXT('S3'!$L$18),NA(),'S3'!$L$18)","v":{"$error":"#N/A"}},null,{"$f":"IF(ISTEXT('S3'!$L$19),NA(),'S3'!$L$19)","v":{"$error":"#N/A"}}]
[{"$f":"IF(ISBLANK('S3'!M$8),\" \",'S3'!M$8)","v":" "},{"$f":"IF(ISTEXT('S3'!$N$14),NA(),'S3'!$N$14)","v":{"$error":"#N/A"}},null,{"$f":"IF(ISTEXT('S3'!$N$16),NA(),'S3'!$N$16)","v":{"$error":"#N/A"}},null,{"$f":"IF(ISTEXT('S3'!$N$17),NA(),'S3'!$N$17)","v":{"$error":"#N/A"}},null,{"$f":"IF(ISTEXT('S3'!$N$18),NA(),'S3'!$N$18)","v":{"$error":"#N/A"}},null,{"$f":"IF(ISTEXT('S3'!$N$19),NA(),'S3'!$N$19)","v":{"$error":"#N/A"}}]
[{"$f":"IF(ISBLANK('S3'!C$26),\" \",'S3'!C$26)","v":" "},{"$f":"IF(ISTEXT('S3'!$D$32),NA(),'S3'!$D$32)","v":{"$error":"#N/A"}},null,{"$f":"IF(ISTEXT('S3'!$D$34),NA(),'S3'!$D$34)","v":{"$error":"#N/A"}},null,{"$f":"IF(ISTEXT('S3'!$D$35),NA(),'S3'!$D$35)","v":{"$error":"#N/A"}},null,{"$f":"IF(ISTEXT('S3'!$D$36),NA(),'S3'!$D$36)","v":{"$error":"#N/A"}},null,{"$f":"IF(ISTEXT('S3'!$D$37),NA(),'S3'!$D$37)","v":{"$error":"#N/A"}}]
[{"$f":"IF(ISBLANK('S3'!E$26),\" \",'S3'!E$26)","v":" "},{"$f":"IF(ISTEXT('S3'!$F$32),NA(),'S3'!$F$32)","v":{"$error":"#N/A"}},null,{"$f":"IF(ISTEXT('S3'!$F$34),NA(),'S3'!$F$34)","v":{"$error":"#N/A"}},null,{"$f":"IF(ISTEXT('S3'!$F$35),NA(),'S3'!$F$35)","v":{"$error":"#N/A"}},null,{"$f":"IF(ISTEXT('S3'!$F$36),NA(),'S3'!$F$36)","v":{"$error":"#N/A"}},null,{"$f":"IF(ISTEXT('S3'!$F$37),NA(),'S3'!$F$37)","v":{"$error":"#N/A"}}]
[{"$f":"IF(ISBLANK('S3'!G$26),\" \",'S3'!G$26)","v":" "},{"$f":"IF(ISTEXT('S3'!$H$32),NA(),'S3'!$H$32)","v":{"$error":"#N/A"}},null,{"$f":"IF(ISTEXT('S3'!$H$34),NA(),'S3'!$H$34)","v":{"$error":"#N/A"}},null,{"$f":"IF(ISTEXT('S3'!$H$35),NA(),'S3'!$H$35)","v":{"$error":"#N/A"}},null,{"$f":"IF(ISTEXT('S3'!$H$36),NA(),'S3'!$H$36)","v":{"$error":"#N/A"}},null,{"$f":"IF(ISTEXT('S3'!$H$37),NA(),'S3'!$H$37)","v":{"$error":"#N/A"}}]
[{"$f":"IF(ISBLANK('S3'!I$26),\" \",'S3'!I$26)","v":" "},{"$f":"IF(ISTEXT('S3'!$J$32),NA(),'S3'!$J$32)","v":{"$error":"#N/A"}},null,{"$f":"IF(ISTEXT('S3'!$J$34),NA(),'S3'!$J$34)","v":{"$error":"#N/A"}},null,{"$f":"IF(ISTEXT('S3'!$J$35),NA(),'S3'!$J$35)","v":{"$error":"#N/A"}},null,{"$f":"IF(ISTEXT('S3'!$J$36),NA(),'S3'!$J$36)","v":{"$error":"#N/A"}},null,{"$f":"IF(ISTEXT('S3'!$J$37),NA(),'S3'!$J$37)","v":{"$error":"#N/A"}}]
[{"$f":"IF(ISBLANK('S3'!K$26),\" \",'S3'!K$26)","v":" "},{"$f":"IF(ISTEXT('S3'!$L$32),NA(),'S3'!$L$32)","v":{"$error":"#N/A"}},null,{"$f":"IF(ISTEXT('S3'!$L$34),NA(),'S3'!$L$34)","v":{"$error":"#N/A"}},null,{"$f":"IF(ISTEXT('S3'!$L$35),NA(),'S3'!$L$35)","v":{"$error":"#N/A"}},null,{"$f":"IF(ISTEXT('S3'!$L$36),NA(),'S3'!$L$36)","v":{"$error":"#N/A"}},null,{"$f":"IF(ISTEXT('S3'!$L$37),NA(),'S3'!$L$37)","v":{"$error":"#N/A"}}]
[{"$f":"IF(ISBLANK('S3'!M$26),\" \",'S3'!M$26)","v":" "},{"$f":"IF(ISTEXT('S3'!$N$32),NA(),'S3'!$N$32)","v":{"$error":"#N/A"}},null,{"$f":"IF(ISTEXT('S3'!$N$34),NA(),'S3'!$N$34)","v":{"$error":"#N/A"}},null,{"$f":"IF(ISTEXT('S3'!$N$35),NA(),'S3'!$N$35)","v":{"$error":"#N/A"}},null,{"$f":"IF(ISTEXT('S3'!$N$36),NA(),'S3'!$N$36)","v":{"$error":"#N/A"}},null,{"$f":"IF(ISTEXT('S3'!$N$37),NA(),'S3'!$N$37)","v":{"$error":"#N/A"}}]
[{"$f":"IF(ISBLANK('S4'!C$8),\" \",'S4'!C$8)","v":" "},{"$f":"IF(ISTEXT('S4'!$D$14),NA(),'S4'!$D$14)","v":{"$error":"#N/A"}},null,{"$f":"IF(ISTEXT('S4'!$D$16),NA(),'S4'!$D$16)","v":{"$error":"#N/A"}},null,{"$f":"IF(ISTEXT('S4'!$D$17),NA(),'S4'!$D$17)","v":{"$error":"#N/A"}},null,{"$f":"IF(ISTEXT('S4'!$D$18),NA(),'S4'!$D$18)","v":{"$error":"#N/A"}},null,{"$f":"IF(ISTEXT('S4'!$D$19),NA(),'S4'!$D$19)","v":{"$error":"#N/A"}}]
[{"$f":"IF(ISBLANK('S4'!E$8),\" \",'S4'!E$8)","v":" "},{"$f":"IF(ISTEXT('S4'!$F$14),NA(),'S4'!$F$14)","v":{"$error":"#N/A"}},null,{"$f":"IF(ISTEXT('S4'!$F$16),NA(),'S4'!$F$16)","v":{"$error":"#N/A"}},null,{"$f":"IF(ISTEXT('S4'!$F$17),NA(),'S4'!$F$17)","v":{"$error":"#N/A"}},null,{"$f":"IF(ISTEXT('S4'!$F$18),NA(),'S4'!$F$18)","v":{"$error":"#N/A"}},null,{"$f":"IF(ISTEXT('S4'!$F$19),NA(),'S4'!$F$19)","v":{"$error":"#N/A"}}]
[{"$f":"IF(ISBLANK('S4'!G$8),\" \",'S4'!G$8)","v":" "},{"$f":"IF(ISTEXT('S4'!$H$14),NA(),'S4'!$H$14)","v":{"$error":"#N/A"}},null,{"$f":"IF(ISTEXT('S4'!$H$16),NA(),'S4'!$H$16)","v":{"$error":"#N/A"}},null,{"$f":"IF(ISTEXT('S4'!$H$17),NA(),'S4'!$H$17)","v":{"$error":"#N/A"}},null,{"$f":"IF(ISTEXT('S4'!$H$18),NA(),'S4'!$H$18)","v":{"$error":"#N/A"}},null,{"$f":"IF(ISTEXT('S4'!$H$19),NA(),'S4'!$H$19)","v":{"$error":"#N/A"}}]
[{"$f":"IF(ISBLANK('S4'!I$8),\" \",'S4'!I$8)","v":" "},{"$f":"IF(ISTEXT('S4'!$J$14),NA(),'S4'!$J$14)","v":{"$error":"#N/A"}},null,{"$f":"IF(ISTEXT('S4'!$J$16),NA(),'S4'!$J$16)","v":{"$error":"#N/A"}},null,{"$f":"IF(ISTEXT('S4'!$J$17),NA(),'S4'!$J$17)","v":{"$error":"#N/A"}},null,{"$f":"IF(ISTEXT('S4'!$J$18),NA(),'S4'!$J$18)","v":{"$error":"#N/A"}},null,{"$f":"IF(ISTEXT('S4'!$J$19),NA(),'S4'!$J$19)","v":{"$error":"#N/A"}}]
[{"$f":"IF(ISBLANK('S4'!K$8),\" \",'S4'!K$8)","v":" "},{"$f":"IF(ISTEXT('S4'!$L$14),NA(),'S4'!$L$14)","v":{"$error":"#N/A"}},null,{"$f":"IF(ISTEXT('S4'!$L$16),NA(),'S4'!$L$16)","v":{"$error":"#N/A"}},null,{"$f":"IF(ISTEXT('S4'!$L$17),NA(),'S4'!$L$17)","v":{"$error":"#N/A"}},null,{"$f":"IF(ISTEXT('S4'!$L$18),NA(),'S4'!$L$18)","v":{"$error":"#N/A"}},null,{"$f":"IF(ISTEXT('S4'!$L$19),NA(),'S4'!$L$19)","v":{"$error":"#N/A"}}]
[{"$f":"IF(ISBLANK('S4'!M$8),\" \",'S4'!M$8)","v":" "},{"$f":"IF(ISTEXT('S4'!$N$14),NA(),'S4'!$N$14)","v":{"$error":"#N/A"}},null,{"$f":"IF(ISTEXT('S4'!$N$16),NA(),'S4'!$N$16)","v":{"$error":"#N/A"}},null,{"$f":"IF(ISTEXT('S4'!$N$17),NA(),'S4'!$N$17)","v":{"$error":"#N/A"}},null,{"$f":"IF(ISTEXT('S4'!$N$18),NA(),'S4'!$N$18)","v":{"$error":"#N/A"}},null,{"$f":"IF(ISTEXT('S4'!$N$19),NA(),'S4'!$N$19)","v":{"$error":"#N/A"}}]
[{"$f":"IF(ISBLANK('S4'!C$26),\" \",'S4'!C$26)","v":" "},{"$f":"IF(ISTEXT('S4'!$D$32),NA(),'S4'!$D$32)","v":{"$error":"#N/A"}},null,{"$f":"IF(ISTEXT('S4'!$D$34),NA(),'S4'!$D$34)","v":{"$error":"#N/A"}},null,{"$f":"IF(ISTEXT('S4'!$D$35),NA(),'S4'!$D$35)","v":{"$error":"#N/A"}},null,{"$f":"IF(ISTEXT('S4'!$D$36),NA(),'S4'!$D$36)","v":{"$error":"#N/A"}},null,{"$f":"IF(ISTEXT('S4'!$D$37),NA(),'S4'!$D$37)","v":{"$error":"#N/A"}}]
[{"$f":"IF(ISBLANK('S4'!E$26),\" \",'S4'!E$26)","v":" "},{"$f":"IF(ISTEXT('S4'!$F$32),NA(),'S4'!$F$32)","v":{"$error":"#N/A"}},null,{"$f":"IF(ISTEXT('S4'!$F$34),NA(),'S4'!$F$34)","v":{"$error":"#N/A"}},null,{"$f":"IF(ISTEXT('S4'!$F$35),NA(),'S4'!$F$35)","v":{"$error":"#N/A"}},null,{"$f":"IF(ISTEXT('S4'!$F$36),NA(),'S4'!$F$36)","v":{"$error":"#N/A"}},null,{"$f":"IF(ISTEXT('S4'!$F$37),NA(),'S4'!$F$37)","v":{"$error":"#N/A"}}]
[{"$f":"IF(ISBLANK('S4'!G$26),\" \",'S4'!G$26)","v":" "},{"$f":"IF(ISTEXT('S4'!$H$32),NA(),'S4'!$H$32)","v":{"$error":"#N/A"}},null,{"$f":"IF(ISTEXT('S4'!$H$34),NA(),'S4'!$H$34)","v":{"$error":"#N/A"}},null,{"$f":"IF(ISTEXT('S4'!$H$35),NA(),'S4'!$H$35)","v":{"$error":"#N/A"}},null,{"$f":"IF(ISTEXT('S4'!$H$36),NA(),'S4'!$H$36)","v":{"$error":"#N/A"}},null,{"$f":"IF(ISTEXT('S4'!$H$37),NA(),'S4'!$H$37)","v":{"$error":"#N/A"}}]
[{"$f":"IF(ISBLANK('S4'!I$26),\" \",'S4'!I$26)","v":" "},{"$f":"IF(ISTEXT('S4'!$J$32),NA(),'S4'!$J$32)","v":{"$error":"#N/A"}},null,{"$f":"IF(ISTEXT('S4'!$J$34),NA(),'S4'!$J$34)","v":{"$error":"#N/A"}},null,{"$f":"IF(ISTEXT('S4'!$J$35),NA(),'S4'!$J$35)","v":{"$error":"#N/A"}},null,{"$f":"IF(ISTEXT('S4'!$J$36),NA(),'S4'!$J$36)","v":{"$error":"#N/A"}},null,{"$f":"IF(ISTEXT('S4'!$J$37),NA(),'S4'!$J$37)","v":{"$error":"#N/A"}}]
[{"$f":"IF(ISBLANK('S4'!K$26),\" \",'S4'!K$26)","v":" "},{"$f":"IF(ISTEXT('S4'!$L$32),NA(),'S4'!$L$32)","v":{"$error":"#N/A"}},null,{"$f":"IF(ISTEXT('S4'!$L$34),NA(),'S4'!$L$34)","v":{"$error":"#N/A"}},null,{"$f":"IF(ISTEXT('S4'!$L$35),NA(),'S4'!$L$35)","v":{"$error":"#N/A"}},null,{"$f":"IF(ISTEXT('S4'!$L$36),NA(),'S4'!$L$36)","v":{"$error":"#N/A"}},null,{"$f":"IF(ISTEXT('S4'!$L$37),NA(),'S4'!$L$37)","v":{"$error":"#N/A"}}]
[{"$f":"IF(ISBLANK('S4'!M$26),\" \",'S4'!M$26)","v":" "},{"$f":"IF(ISTEXT('S4'!$N$32),NA(),'S4'!$N$32)","v":{"$error":"#N/A"}},null,{"$f":"IF(ISTEXT('S4'!$N$34),NA(),'S4'!$N$34)","v":{"$error":"#N/A"}},null,{"$f":"IF(ISTEXT('S4'!$N$35),NA(),'S4'!$N$35)","v":{"$error":"#N/A"}},null,{"$f":"IF(ISTEXT('S4'!$N$36),NA(),'S4'!$N$36)","v":{"$error":"#N/A"}},null,{"$f":"IF(ISTEXT('S4'!$N$37),NA(),'S4'!$N$37)","v":{"$error":"#N/A"}}]
[{"$f":"IF(ISBLANK('S5'!C$8),\" \",'S5'!C$8)","v":" "},{"$f":"IF(ISTEXT('S5'!$D$14),NA(),'S5'!$D$14)","v":{"$error":"#N/A"}},null,{"$f":"IF(ISTEXT('S5'!$D$16),NA(),'S5'!$D$16)","v":{"$error":"#N/A"}},null,{"$f":"IF(ISTEXT('S5'!$D$17),NA(),'S5'!$D$17)","v":{"$error":"#N/A"}},null,{"$f":"IF(ISTEXT('S5'!$D$18),NA(),'S5'!$D$18)","v":{"$error":"#N/A"}},null,{"$f":"IF(ISTEXT('S5'!$D$19),NA(),'S5'!$D$19)","v":{"$error":"#N/A"}}]
[{"$f":"IF(ISBLANK('S5'!E$8),\" \",'S5'!E$8)","v":" "},{"$f":"IF(ISTEXT('S5'!$F$14),NA(),'S5'!$F$14)","v":{"$error":"#N/A"}},null,{"$f":"IF(ISTEXT('S5'!$F$16),NA(),'S5'!$F$16)","v":{"$error":"#N/A"}},null,{"$f":"IF(ISTEXT('S5'!$F$17),NA(),'S5'!$F$17)","v":{"$error":"#N/A"}},null,{"$f":"IF(ISTEXT('S5'!$F$18),NA(),'S5'!$F$18)","v":{"$error":"#N/A"}},null,{"$f":"IF(ISTEXT('S5'!$F$19),NA(),'S5'!$F$19)","v":{"$error":"#N/A"}}]
[{"$f":"IF(ISBLANK('S5'!G$8),\" \",'S5'!G$8)","v":" "},{"$f":"IF(ISTEXT('S5'!$H$14),NA(),'S5'!$H$14)","v":{"$error":"#N/A"}},null,{"$f":"IF(ISTEXT('S5'!$H$16),NA(),'S5'!$H$16)","v":{"$error":"#N/A"}},null,{"$f":"IF(ISTEXT('S5'!$H$17),NA(),'S5'!$H$17)","v":{"$error":"#N/A"}},null,{"$f":"IF(ISTEXT('S5'!$H$18),NA(),'S5'!$H$18)","v":{"$error":"#N/A"}},null,{"$f":"IF(ISTEXT('S5'!$H$19),NA(),'S5'!$H$19)","v":{"$error":"#N/A"}}]
[{"$f":"IF(ISBLANK('S5'!I$8),\" \",'S5'!I$8)","v":" "},{"$f":"IF(ISTEXT('S5'!$J$14),NA(),'S5'!$J$14)","v":{"$error":"#N/A"}},null,{"$f":"IF(ISTEXT('S5'!$J$16),NA(),'S5'!$J$16)","v":{"$error":"#N/A"}},null,{"$f":"IF(ISTEXT('S5'!$J$17),NA(),'S5'!$J$17)","v":{"$error":"#N/A"}},null,{"$f":"IF(ISTEXT('S5'!$J$18),NA(),'S5'!$J$18)","v":{"$error":"#N/A"}},null,{"$f":"IF(ISTEXT('S5'!$J$19),NA(),'S5'!$J$19)","v":{"$error":"#N/A"}}]
[{"$f":"IF(ISBLANK('S5'!K$8),\" \",'S5'!K$8)","v":" "},{"$f":"IF(ISTEXT('S5'!$L$14),NA(),'S5'!$L$14)","v":{"$error":"#N/A"}},null,{"$f":"IF(ISTEXT('S5'!$L$16),NA(),'S5'!$L$16)","v":{"$error":"#N/A"}},null,{"$f":"IF(ISTEXT('S5'!$L$17),NA(),'S5'!$L$17)","v":{"$error":"#N/A"}},null,{"$f":"IF(ISTEXT('S5'!$L$18),NA(),'S5'!$L$18)","v":{"$error":"#N/A"}},null,{"$f":"IF(ISTEXT('S5'!$L$19),NA(),'S5'!$L$19)","v":{"$error":"#N/A"}}]
[{"$f":"IF(ISBLANK('S5'!M$8),\" \",'S5'!M$8)","v":" "},{"$f":"IF(ISTEXT('S5'!$N$14),NA(),'S5'!$N$14)","v":{"$error":"#N/A"}},null,{"$f":"IF(ISTEXT('S5'!$N$16),NA(),'S5'!$N$16)","v":{"$error":"#N/A"}},null,{"$f":"IF(ISTEXT('S5'!$N$17),NA(),'S5'!$N$17)","v":{"$error":"#N/A"}},null,{"$f":"IF(ISTEXT('S5'!$N$18),NA(),'S5'!$N$18)","v":{"$error":"#N/A"}},null,{"$f":"IF(ISTEXT('S5'!$N$19),NA(),'S5'!$N$19)","v":{"$error":"#N/A"}}]
[{"$f":"IF(ISBLANK('S5'!C$26),\" \",'S5'!C$26)","v":" "},{"$f":"IF(ISTEXT('S5'!$D$32),NA(),'S5'!$D$32)","v":{"$error":"#N/A"}},null,{"$f":"IF(ISTEXT('S5'!$D$34),NA(),'S5'!$D$34)","v":{"$error":"#N/A"}},null,{"$f":"IF(ISTEXT('S5'!$D$35),NA(),'S5'!$D$35)","v":{"$error":"#N/A"}},null,{"$f":"IF(ISTEXT('S5'!$D$36),NA(),'S5'!$D$36)","v":{"$error":"#N/A"}},null,{"$f":"IF(ISTEXT('S5'!$D$37),NA(),'S5'!$D$37)","v":{"$error":"#N/A"}}]
[{"$f":"IF(ISBLANK('S5'!E$26),\" \",'S5'!E$26)","v":" "},{"$f":"IF(ISTEXT('S5'!$F$32),NA(),'S5'!$F$32)","v":{"$error":"#N/A"}},null,{"$f":"IF(ISTEXT('S5'!$F$34),NA(),'S5'!$F$34)","v":{"$error":"#N/A"}},null,{"$f":"IF(ISTEXT('S5'!$F$35),NA(),'S5'!$F$35)","v":{"$error":"#N/A"}},null,{"$f":"IF(ISTEXT('S5'!$F$36),NA(),'S5'!$F$36)","v":{"$error":"#N/A"}},null,{"$f":"IF(ISTEXT('S5'!$F$37),NA(),'S5'!$F$37)","v":{"$error":"#N/A"}}]
[{"$f":"IF(ISBLANK('S5'!G$26),\" \",'S5'!G$26)","v":" "},{"$f":"IF(ISTEXT('S5'!$H$32),NA(),'S5'!$H$32)","v":{"$error":"#N/A"}},null,{"$f":"IF(ISTEXT('S5'!$H$34),NA(),'S5'!$H$34)","v":{"$error":"#N/A"}},null,{"$f":"IF(ISTEXT('S5'!$H$35),NA(),'S5'!$H$35)","v":{"$error":"#N/A"}},null,{"$f":"IF(ISTEXT('S5'!$H$36),NA(),'S5'!$H$36)","v":{"$error":"#N/A"}},null,{"$f":"IF(ISTEXT('S5'!$H$37),NA(),'S5'!$H$37)","v":{"$error":"#N/A"}}]
[{"$f":"IF(ISBLANK('S5'!I$26),\" \",'S5'!I$26)","v":" "},{"$f":"IF(ISTEXT('S5'!$J$32),NA(),'S5'!$J$32)","v":{"$error":"#N/A"}},null,{"$f":"IF(ISTEXT('S5'!$J$34),NA(),'S5'!$J$34)","v":{"$error":"#N/A"}},null,{"$f":"IF(ISTEXT('S5'!$J$35),NA(),'S5'!$J$35)","v":{"$error":"#N/A"}},null,{"$f":"IF(ISTEXT('S5'!$J$36),NA(),'S5'!$J$36)","v":{"$error":"#N/A"}},null,{"$f":"IF(ISTEXT('S5'!$J$37),NA(),'S5'!$J$37)","v":{"$error":"#N/A"}}]
[{"$f":"IF(ISBLANK('S5'!K$26),\" \",'S5'!K$26)","v":" "},{"$f":"IF(ISTEXT('S5'!$L$32),NA(),'S5'!$L$32)","v":{"$error":"#N/A"}},null,{"$f":"IF(ISTEXT('S5'!$L$34),NA(),'S5'!$L$34)","v":{"$error":"#N/A"}},null,{"$f":"IF(ISTEXT('S5'!$L$35),NA(),'S5'!$L$35)","v":{"$error":"#N/A"}},null,{"$f":"IF(ISTEXT('S5'!$L$36),NA(),'S5'!$L$36)","v":{"$error":"#N/A"}},null,{"$f":"IF(ISTEXT('S5'!$L$37),NA(),'S5'!$L$37)","v":{"$error":"#N/A"}}]
[{"$f":"IF(ISBLANK('S5'!M$26),\" \",'S5'!M$26)","v":" "},{"$f":"IF(ISTEXT('S5'!$N$32),NA(),'S5'!$N$32)","v":{"$error":"#N/A"}},null,{"$f":"IF(ISTEXT('S5'!$N$34),NA(),'S5'!$N$34)","v":{"$error":"#N/A"}},null,{"$f":"IF(ISTEXT('S5'!$N$35),NA(),'S5'!$N$35)","v":{"$error":"#N/A"}},null,{"$f":"IF(ISTEXT('S5'!$N$36),NA(),'S5'!$N$36)","v":{"$error":"#N/A"}},null,{"$f":"IF(ISTEXT('S5'!$N$37),NA(),'S5'!$N$37)","v":{"$error":"#N/A"}}]
[{"$f":"IF(ISBLANK('S6'!C$8),\" \",'S6'!C$8)","v":" "},{"$f":"IF(ISTEXT('S6'!$D$14),NA(),'S6'!$D$14)","v":{"$error":"#N/A"}},null,{"$f":"IF(ISTEXT('S6'!$D$16),NA(),'S6'!$D$16)","v":{"$error":"#N/A"}},null,{"$f":"IF(ISTEXT('S6'!$D$17),NA(),'S6'!$D$17)","v":{"$error":"#N/A"}},null,{"$f":"IF(ISTEXT('S6'!$D$18),NA(),'S6'!$D$18)","v":{"$error":"#N/A"}},null,{"$f":"IF(ISTEXT('S6'!$D$19),NA(),'S6'!$D$19)","v":{"$error":"#N/A"}}]
[{"$f":"IF(ISBLANK('S6'!E$8),\" \",'S6'!E$8)","v":" "},{"$f":"IF(ISTEXT('S6'!$F$14),NA(),'S6'!$F$14)","v":{"$error":"#N/A"}},null,{"$f":"IF(ISTEXT('S6'!$F$16),NA(),'S6'!$F$16)","v":{"$error":"#N/A"}},null,{"$f":"IF(ISTEXT('S6'!$F$17),NA(),'S6'!$F$17)","v":{"$error":"#N/A"}},null,{"$f":"IF(ISTEXT('S6'!$F$18),NA(),'S6'!$F$18)","v":{"$error":"#N/A"}},null,{"$f":"IF(ISTEXT('S6'!$F$19),NA(),'S6'!$F$19)","v":{"$error":"#N/A"}}]
[{"$f":"IF(ISBLANK('S6'!G$8),\" \",'S6'!G$8)","v":" "},{"$f":"IF(ISTEXT('S6'!$H$14),NA(),'S6'!$H$14)","v":{"$error":"#N/A"}},null,{"$f":"IF(ISTEXT('S6'!$H$16),NA(),'S6'!$H$16)","v":{"$error":"#N/A"}},null,{"$f":"IF(ISTEXT('S6'!$H$17),NA(),'S6'!$H$17)","v":{"$error":"#N/A"}},null,{"$f":"IF(ISTEXT('S6'!$H$18),NA(),'S6'!$H$18)","v":{"$error":"#N/A"}},null,{"$f":"IF(ISTEXT('S6'!$H$19),NA(),'S6'!$H$19)","v":{"$error":"#N/A"}}]
[{"$f":"IF(ISBLANK('S6'!I$8),\" \",'S6'!I$8)","v":" "},{"$f":"IF(ISTEXT('S6'!$J$14),NA(),'S6'!$J$14)","v":{"$error":"#N/A"}},null,{"$f":"IF(ISTEXT('S6'!$J$16),NA(),'S6'!$J$16)","v":{"$error":"#N/A"}},null,{"$f":"IF(ISTEXT('S6'!$J$17),NA(),'S6'!$J$17)","v":{"$error":"#N/A"}},null,{"$f":"IF(ISTEXT('S6'!$J$18),NA(),'S6'!$J$18)","v":{"$error":"#N/A"}},null,{"$f":"IF(ISTEXT('S6'!$J$19),NA(),'S6'!$J$19)","v":{"$error":"#N/A"}}]
[{"$f":"IF(ISBLANK('S6'!K$8),\" \",'S6'!K$8)","v":" "},{"$f":"IF(ISTEXT('S6'!$L$14),NA(),'S6'!$L$14)","v":{"$error":"#N/A"}},null,{"$f":"IF(ISTEXT('S6'!$L$16),NA(),'S6'!$L$16)","v":{"$error":"#N/A"}},null,{"$f":"IF(ISTEXT('S6'!$L$17),NA(),'S6'!$L$17)","v":{"$error":"#N/A"}},null,{"$f":"IF(ISTEXT('S6'!$L$18),NA(),'S6'!$L$18)","v":{"$error":"#N/A"}},null,{"$f":"IF(ISTEXT('S6'!$L$19),NA(),'S6'!$L$19)","v":{"$error":"#N/A"}}]
[{"$f":"IF(ISBLANK('S6'!M$8),\" \",'S6'!M$8)","v":" "},{"$f":"IF(ISTEXT('S6'!$N$14),NA(),'S6'!$N$14)","v":{"$error":"#N/A"}},null,{"$f":"IF(ISTEXT('S6'!$N$16),NA(),'S6'!$N$16)","v":{"$error":"#N/A"}},null,{"$f":"IF(ISTEXT('S6'!$N$17),NA(),'S6'!$N$17)","v":{"$error":"#N/A"}},null,{"$f":"IF(ISTEXT('S6'!$N$18),NA(),'S6'!$N$18)","v":{"$error":"#N/A"}},null,{"$f":"IF(ISTEXT('S6'!$N$19),NA(),'S6'!$N$19)","v":{"$error":"#N/A"}}]
[{"$f":"IF(ISBLANK('S6'!C$26),\" \",'S6'!C$26)","v":" "},{"$f":"IF(ISTEXT('S6'!$D$32),NA(),'S6'!$D$32)","v":{"$error":"#N/A"}},null,{"$f":"IF(ISTEXT('S6'!$D$34),NA(),'S6'!$D$34)","v":{"$error":"#N/A"}},null,{"$f":"IF(ISTEXT('S6'!$D$35),NA(),'S6'!$D$35)","v":{"$error":"#N/A"}},null,{"$f":"IF(ISTEXT('S6'!$D$36),NA(),'S6'!$D$36)","v":{"$error":"#N/A"}},null,{"$f":"IF(ISTEXT('S6'!$D$37),NA(),'S6'!$D$37)","v":{"$error":"#N/A"}}]
[{"$f":"IF(ISBLANK('S6'!E$26),\" \",'S6'!E$26)","v":" "},{"$f":"IF(ISTEXT('S6'!$F$32),NA(),'S6'!$F$32)","v":{"$error":"#N/A"}},null,{"$f":"IF(ISTEXT('S6'!$F$34),NA(),'S6'!$F$34)","v":{"$error":"#N/A"}},null,{"$f":"IF(ISTEXT('S6'!$F$35),NA(),'S6'!$F$35)","v":{"$error":"#N/A"}},null,{"$f":"IF(ISTEXT('S6'!$F$36),NA(),'S6'!$F$36)","v":{"$error":"#N/A"}},null,{"$f":"IF(ISTEXT('S6'!$F$37),NA(),'S6'!$F$37)","v":{"$error":"#N/A"}}]
[{"$f":"IF(ISBLANK('S6'!G$26),\" \",'S6'!G$26)","v":" "},{"$f":"IF(ISTEXT('S6'!$H$32),NA(),'S6'!$H$32)","v":{"$error":"#N/A"}},null,{"$f":"IF(ISTEXT('S6'!$H$34),NA(),'S6'!$H$34)","v":{"$error":"#N/A"}},null,{"$f":"IF(ISTEXT('S6'!$H$35),NA(),'S6'!$H$35)","v":{"$error":"#N/A"}},null,{"$f":"IF(ISTEXT('S6'!$H$36),NA(),'S6'!$H$36)","v":{"$error":"#N/A"}},null,{"$f":"IF(ISTEXT('S6'!$H$37),NA(),'S6'!$H$37)","v":{"$error":"#N/A"}}]
[{"$f":"IF(ISBLANK('S6'!I$26),\" \",'S6'!I$26)","v":" "},{"$f":"IF(ISTEXT('S6'!$J$32),NA(),'S6'!$J$32)","v":{"$error":"#N/A"}},null,{"$f":"IF(ISTEXT('S6'!$J$34),NA(),'S6'!$J$34)","v":{"$error":"#N/A"}},null,{"$f":"IF(ISTEXT('S6'!$J$35),NA(),'S6'!$J$35)","v":{"$error":"#N/A"}},null,{"$f":"IF(ISTEXT('S6'!$J$36),NA(),'S6'!$J$36)","v":{"$error":"#N/A"}},null,{"$f":"IF(ISTEXT('S6'!$J$37),NA(),'S6'!$J$37)","v":{"$error":"#N/A"}}]
[{"$f":"IF(ISBLANK('S6'!K$26),\" \",'S6'!K$26)","v":" "},{"$f":"IF(ISTEXT('S6'!$L$32),NA(),'S6'!$L$32)","v":{"$error":"#N/A"}},null,{"$f":"IF(ISTEXT('S6'!$L$34),NA(),'S6'!$L$34)","v":{"$error":"#N/A"}},null,{"$f":"IF(ISTEXT('S6'!$L$35),NA(),'S6'!$L$35)","v":{"$error":"#N/A"}},null,{"$f":"IF(ISTEXT('S6'!$L$36),NA(),'S6'!$L$36)","v":{"$error":"#N/A"}},null,{"$f":"IF(ISTEXT('S6'!$L$37),NA(),'S6'!$L$37)","v":{"$error":"#N/A"}}]
[{"$f":"IF(ISBLANK('S6'!M$26),\" \",'S6'!M$26)","v":" "},{"$f":"IF(ISTEXT('S6'!$N$32),NA(),'S6'!$N$32)","v":{"$error":"#N/A"}},null,{"$f":"IF(ISTEXT('S6'!$N$34),NA(),'S6'!$N$34)","v":{"$error":"#N/A"}},null,{"$f":"IF(ISTEXT('S6'!$N$35),NA(),'S6'!$N$35)","v":{"$error":"#N/A"}},null,{"$f":"IF(ISTEXT('S6'!$N$36),NA(),'S6'!$N$36)","v":{"$error":"#N/A"}},null,{"$f":"IF(ISTEXT('S6'!$N$37),NA(),'S6'!$N$37)","v":{"$error":"#N/A"}}]
[{"$f":"IF(ISBLANK('S7'!C$8),\" \",'S7'!C$8)","v":" "},{"$f":"IF(ISTEXT('S7'!$D$14),NA(),'S7'!$D$14)","v":{"$error":"#N/A"}},null,{"$f":"IF(ISTEXT('S7'!$D$16),NA(),'S7'!$D$16)","v":{"$error":"#N/A"}},null,{"$f":"IF(ISTEXT('S7'!$D$17),NA(),'S7'!$D$17)","v":{"$error":"#N/A"}},null,{"$f":"IF(ISTEXT('S7'!$D$18),NA(),'S7'!$D$18)","v":{"$error":"#N/A"}},null,{"$f":"IF(ISTEXT('S7'!$D$19),NA(),'S7'!$D$19)","v":{"$error":"#N/A"}}]
[{"$f":"IF(ISBLANK('S7'!E$8),\" \",'S7'!E$8)","v":" "},{"$f":"IF(ISTEXT('S7'!$F$14),NA(),'S7'!$F$14)","v":{"$error":"#N/A"}},null,{"$f":"IF(ISTEXT('S7'!$F$16),NA(),'S7'!$F$16)","v":{"$error":"#N/A"}},null,{"$f":"IF(ISTEXT('S7'!$F$17),NA(),'S7'!$F$17)","v":{"$error":"#N/A"}},null,{"$f":"IF(ISTEXT('S7'!$F$18),NA(),'S7'!$F$18)","v":{"$error":"#N/A"}},null,{"$f":"IF(ISTEXT('S7'!$F$19),NA(),'S7'!$F$19)","v":{"$error":"#N/A"}}]
[{"$f":"IF(ISBLANK('S7'!G$8),\" \",'S7'!G$8)","v":" "},{"$f":"IF(ISTEXT('S7'!$H$14),NA(),'S7'!$H$14)","v":{"$error":"#N/A"}},null,{"$f":"IF(ISTEXT('S7'!$H$16),NA(),'S7'!$H$16)","v":{"$error":"#N/A"}},null,{"$f":"IF(ISTEXT('S7'!$H$17),NA(),'S7'!$H$17)","v":{"$error":"#N/A"}},null,{"$f":"IF(ISTEXT('S7'!$H$18),NA(),'S7'!$H$18)","v":{"$error":"#N/A"}},null,{"$f":"IF(ISTEXT('S7'!$H$19),NA(),'S7'!$H$19)","v":{"$error":"#N/A"}}]
[{"$f":"IF(ISBLANK('S7'!I$8),\" \",'S7'!I$8)","v":" "},{"$f":"IF(ISTEXT('S7'!$J$14),NA(),'S7'!$J$14)","v":{"$error":"#N/A"}},null,{"$f":"IF(ISTEXT('S7'!$J$16),NA(),'S7'!$J$16)","v":{"$error":"#N/A"}},null,{"$f":"IF(ISTEXT('S7'!$J$17),NA(),'S7'!$J$17)","v":{"$error":"#N/A"}},null,{"$f":"IF(ISTEXT('S7'!$J$18),NA(),'S7'!$J$18)","v":{"$error":"#N/A"}},null,{"$f":"IF(ISTEXT('S7'!$J$19),NA(),'S7'!$J$19)","v":{"$error":"#N/A"}}]
[{"$f":"IF(ISBLANK('S7'!K$8),\" \",'S7'!K$8)","v":" "},{"$f":"IF(ISTEXT('S7'!$L$14),NA(),'S7'!$L$14)","v":{"$error":"#N/A"}},null,{"$f":"IF(ISTEXT('S7'!$L$16),NA(),'S7'!$L$16)","v":{"$error":"#N/A"}},null,{"$f":"IF(ISTEXT('S7'!$L$17),NA(),'S7'!$L$17)","v":{"$error":"#N/A"}},null,{"$f":"IF(ISTEXT('S7'!$L$18),NA(),'S7'!$L$18)","v":{"$error":"#N/A"}},null,{"$f":"IF(ISTEXT('S7'!$L$19),NA(),'S7'!$L$19)","v":{"$error":"#N/A"}}]
[{"$f":"IF(ISBLANK('S7'!M$8),\" \",'S7'!M$8)","v":" "},{"$f":"IF(ISTEXT('S7'!$N$14),NA(),'S7'!$N$14)","v":{"$error":"#N/A"}},null,{"$f":"IF(ISTEXT('S7'!$N$16),NA(),'S7'!$N$16)","v":{"$error":"#N/A"}},null,{"$f":"IF(ISTEXT('S7'!$N$17),NA(),'S7'!$N$17)","v":{"$error":"#N/A"}},null,{"$f":"IF(ISTEXT('S7'!$N$18),NA(),'S7'!$N$18)","v":{"$error":"#N/A"}},null,{"$f":"IF(ISTEXT('S7'!$N$19),NA(),'S7'!$N$19)","v":{"$error":"#N/A"}}]
[{"$f":"IF(ISBLANK('S7'!C$26),\" \",'S7'!C$26)","v":" "},{"$f":"IF(ISTEXT('S7'!$D$32),NA(),'S7'!$D$32)","v":{"$error":"#N/A"}},null,{"$f":"IF(ISTEXT('S7'!$D$34),NA(),'S7'!$D$34)","v":{"$error":"#N/A"}},null,{"$f":"IF(ISTEXT('S7'!$D$35),NA(),'S7'!$D$35)","v":{"$error":"#N/A"}},null,{"$f":"IF(ISTEXT('S7'!$D$36),NA(),'S7'!$D$36)","v":{"$error":"#N/A"}},null,{"$f":"IF(ISTEXT('S7'!$D$37),NA(),'S7'!$D$37)","v":{"$error":"#N/A"}}]
[{"$f":"IF(ISBLANK('S7'!E$26),\" \",'S7'!E$26)","v":" "},{"$f":"IF(ISTEXT('S7'!$F$32),NA(),'S7'!$F$32)","v":{"$error":"#N/A"}},null,{"$f":"IF(ISTEXT('S7'!$F$34),NA(),'S7'!$F$34)","v":{"$error":"#N/A"}},null,{"$f":"IF(ISTEXT('S7'!$F$35),NA(),'S7'!$F$35)","v":{"$error":"#N/A"}},null,{"$f":"IF(ISTEXT('S7'!$F$36),NA(),'S7'!$F$36)","v":{"$error":"#N/A"}},null,{"$f":"IF(ISTEXT('S7'!$F$37),NA(),'S7'!$F$37)","v":{"$error":"#N/A"}}]
[{"$f":"IF(ISBLANK('S7'!G$26),\" \",'S7'!G$26)","v":" "},{"$f":"IF(ISTEXT('S7'!$H$32),NA(),'S7'!$H$32)","v":{"$error":"#N/A"}},null,{"$f":"IF(ISTEXT('S7'!$H$34),NA(),'S7'!$H$34)","v":{"$error":"#N/A"}},null,{"$f":"IF(ISTEXT('S7'!$H$35),NA(),'S7'!$H$35)","v":{"$error":"#N/A"}},null,{"$f":"IF(ISTEXT('S7'!$H$36),NA(),'S7'!$H$36)","v":{"$error":"#N/A"}},null,{"$f":"IF(ISTEXT('S7'!$H$37),NA(),'S7'!$H$37)","v":{"$error":"#N/A"}}]
[{"$f":"IF(ISBLANK('S7'!I$26),\" \",'S7'!I$26)","v":" "},{"$f":"IF(ISTEXT('S7'!$J$32),NA(),'S7'!$J$32)","v":{"$error":"#N/A"}},null,{"$f":"IF(ISTEXT('S7'!$J$34),NA(),'S7'!$J$34)","v":{"$error":"#N/A"}},null,{"$f":"IF(ISTEXT('S7'!$J$35),NA(),'S7'!$J$35)","v":{"$error":"#N/A"}},null,{"$f":"IF(ISTEXT('S7'!$J$36),NA(),'S7'!$J$36)","v":{"$error":"#N/A"}},null,{"$f":"IF(ISTEXT('S7'!$J$37),NA(),'S7'!$J$37)","v":{"$error":"#N/A"}}]
[{"$f":"IF(ISBLANK('S7'!K$26),\" \",'S7'!K$26)","v":" "},{"$f":"IF(ISTEXT('S7'!$L$32),NA(),'S7'!$L$32)","v":{"$error":"#N/A"}},null,{"$f":"IF(ISTEXT('S7'!$L$34),NA(),'S7'!$L$34)","v":{"$error":"#N/A"}},null,{"$f":"IF(ISTEXT('S7'!$L$35),NA(),'S7'!$L$35)","v":{"$error":"#N/A"}},null,{"$f":"IF(ISTEXT('S7'!$L$36),NA(),'S7'!$L$36)","v":{"$error":"#N/A"}},null,{"$f":"IF(ISTEXT('S7'!$L$37),NA(),'S7'!$L$37)","v":{"$error":"#N/A"}}]
[{"$f":"IF(ISBLANK('S7'!M$26),\" \",'S7'!M$26)","v":" "},{"$f":"IF(ISTEXT('S7'!$N$32),NA(),'S7'!$N$32)","v":{"$error":"#N/A"}},null,{"$f":"IF(ISTEXT('S7'!$N$34),NA(),'S7'!$N$34)","v":{"$error":"#N/A"}},null,{"$f":"IF(ISTEXT('S7'!$N$35),NA(),'S7'!$N$35)","v":{"$error":"#N/A"}},null,{"$f":"IF(ISTEXT('S7'!$N$36),NA(),'S7'!$N$36)","v":{"$error":"#N/A"}},null,{"$f":"IF(ISTEXT('S7'!$N$37),NA(),'S7'!$N$37)","v":{"$error":"#N/A"}}]
[{"$f":"IF(ISBLANK('S8'!C$8),\" \",'S8'!C$8)","v":" "},{"$f":"IF(ISTEXT('S8'!$D$14),NA(),'S8'!$D$14)","v":{"$error":"#N/A"}},null,{"$f":"IF(ISTEXT('S8'!$D$16),NA(),'S8'!$D$16)","v":{"$error":"#N/A"}},null,{"$f":"IF(ISTEXT('S8'!$D$17),NA(),'S8'!$D$17)","v":{"$error":"#N/A"}},null,{"$f":"IF(ISTEXT('S8'!$D$18),NA(),'S8'!$D$18)","v":{"$error":"#N/A"}},null,{"$f":"IF(ISTEXT('S8'!$D$19),NA(),'S8'!$D$19)","v":{"$error":"#N/A"}}]
[{"$f":"IF(ISBLANK('S8'!E$8),\" \",'S8'!E$8)","v":" "},{"$f":"IF(ISTEXT('S8'!$F$14),NA(),'S8'!$F$14)","v":{"$error":"#N/A"}},null,{"$f":"IF(ISTEXT('S8'!$F$16),NA(),'S8'!$F$16)","v":{"$error":"#N/A"}},null,{"$f":"IF(ISTEXT('S8'!$F$17),NA(),'S8'!$F$17)","v":{"$error":"#N/A"}},null,{"$f":"IF(ISTEXT('S8'!$F$18),NA(),'S8'!$F$18)","v":{"$error":"#N/A"}},null,{"$f":"IF(ISTEXT('S8'!$F$19),NA(),'S8'!$F$19)","v":{"$error":"#N/A"}}]
[{"$f":"IF(ISBLANK('S8'!G$8),\" \",'S8'!G$8)","v":" "},{"$f":"IF(ISTEXT('S8'!$H$14),NA(),'S8'!$H$14)","v":{"$error":"#N/A"}},null,{"$f":"IF(ISTEXT('S8'!$H$16),NA(),'S8'!$H$16)","v":{"$error":"#N/A"}},null,{"$f":"IF(ISTEXT('S8'!$H$17),NA(),'S8'!$H$17)","v":{"$error":"#N/A"}},null,{"$f":"IF(ISTEXT('S8'!$H$18),NA(),'S8'!$H$18)","v":{"$error":"#N/A"}},null,{"$f":"IF(ISTEXT('S8'!$H$19),NA(),'S8'!$H$19)","v":{"$error":"#N/A"}}]
[{"$f":"IF(ISBLANK('S8'!I$8),\" \",'S8'!I$8)","v":" "},{"$f":"IF(ISTEXT('S8'!$J$14),NA(),'S8'!$J$14)","v":{"$error":"#N/A"}},null,{"$f":"IF(ISTEXT('S8'!$J$16),NA(),'S8'!$J$16)","v":{"$error":"#N/A"}},null,{"$f":"IF(ISTEXT('S8'!$J$17),NA(),'S8'!$J$17)","v":{"$error":"#N/A"}},null,{"$f":"IF(ISTEXT('S8'!$J$18),NA(),'S8'!$J$18)","v":{"$error":"#N/A"}},null,{"$f":"IF(ISTEXT('S8'!$J$19),NA(),'S8'!$J$19)","v":{"$error":"#N/A"}}]
[{"$f":"IF(ISBLANK('S8'!K$8),\" \",'S8'!K$8)","v":" "},{"$f":"IF(ISTEXT('S8'!$L$14),NA(),'S8'!$L$14)","v":{"$error":"#N/A"}},null,{"$f":"IF(ISTEXT('S8'!$L$16),NA(),'S8'!$L$16)","v":{"$error":"#N/A"}},null,{"$f":"IF(ISTEXT('S8'!$L$17),NA(),'S8'!$L$17)","v":{"$error":"#N/A"}},null,{"$f":"IF(ISTEXT('S8'!$L$18),NA(),'S8'!$L$18)","v":{"$error":"#N/A"}},null,{"$f":"IF(ISTEXT('S8'!$L$19),NA(),'S8'!$L$19)","v":{"$error":"#N/A"}}]
[{"$f":"IF(ISBLANK('S8'!M$8),\" \",'S8'!M$8)","v":" "},{"$f":"IF(ISTEXT('S8'!$N$14),NA(),'S8'!$N$14)","v":{"$error":"#N/A"}},null,{"$f":"IF(ISTEXT('S8'!$N$16),NA(),'S8'!$N$16)","v":{"$error":"#N/A"}},null,{"$f":"IF(ISTEXT('S8'!$N$17),NA(),'S8'!$N$17)","v":{"$error":"#N/A"}},null,{"$f":"IF(ISTEXT('S8'!$N$18),NA(),'S8'!$N$18)","v":{"$error":"#N/A"}},null,{"$f":"IF(ISTEXT('S8'!$N$19),NA(),'S8'!$N$19)","v":{"$error":"#N/A"}}]
[{"$f":"IF(ISBLANK('S8'!C$26),\" \",'S8'!C$26)","v":" "},{"$f":"IF(ISTEXT('S8'!$D$32),NA(),'S8'!$D$32)","v":{"$error":"#N/A"}},null,{"$f":"IF(ISTEXT('S8'!$D$34),NA(),'S8'!$D$34)","v":{"$error":"#N/A"}},null,{"$f":"IF(ISTEXT('S8'!$D$35),NA(),'S8'!$D$35)","v":{"$error":"#N/A"}},null,{"$f":"IF(ISTEXT('S8'!$D$36),NA(),'S8'!$D$36)","v":{"$error":"#N/A"}},null,{"$f":"IF(ISTEXT('S8'!$D$37),NA(),'S8'!$D$37)","v":{"$error":"#N/A"}}]
[{"$f":"IF(ISBLANK('S8'!E$26),\" \",'S8'!E$26)","v":" "},{"$f":"IF(ISTEXT('S8'!$F$32),NA(),'S8'!$F$32)","v":{"$error":"#N/A"}},null,{"$f":"IF(ISTEXT('S8'!$F$34),NA(),'S8'!$F$34)","v":{"$error":"#N/A"}},null,{"$f":"IF(ISTEXT('S8'!$F$35),NA(),'S8'!$F$35)","v":{"$error":"#N/A"}},null,{"$f":"IF(ISTEXT('S8'!$F$36),NA(),'S8'!$F$36)","v":{"$error":"#N/A"}},null,{"$f":"IF(ISTEXT('S8'!$F$37),NA(),'S8'!$F$37)","v":{"$error":"#N/A"}}]
[{"$f":"IF(ISBLANK('S8'!G$26),\" \",'S8'!G$26)","v":" "},{"$f":"IF(ISTEXT('S8'!$H$32),NA(),'S8'!$H$32)","v":{"$error":"#N/A"}},null,{"$f":"IF(ISTEXT('S8'!$H$34),NA(),'S8'!$H$34)","v":{"$error":"#N/A"}},null,{"$f":"IF(ISTEXT('S8'!$H$35),NA(),'S8'!$H$35)","v":{"$error":"#N/A"}},null,{"$f":"IF(ISTEXT('S8'!$H$36),NA(),'S8'!$H$36)","v":{"$error":"#N/A"}},null,{"$f":"IF(ISTEXT('S8'!$H$37),NA(),'S8'!$H$37)","v":{"$error":"#N/A"}}]
[{"$f":"IF(ISBLANK('S8'!I$26),\" \",'S8'!I$26)","v":" "},{"$f":"IF(ISTEXT('S8'!$J$32),NA(),'S8'!$J$32)","v":{"$error":"#N/A"}},null,{"$f":"IF(ISTEXT('S8'!$J$34),NA(),'S8'!$J$34)","v":{"$error":"#N/A"}},null,{"$f":"IF(ISTEXT('S8'!$J$35),NA(),'S8'!$J$35)","v":{"$error":"#N/A"}},null,{"$f":"IF(ISTEXT('S8'!$J$36),NA(),'S8'!$J$36)","v":{"$error":"#N/A"}},null,{"$f":"IF(ISTEXT('S8'!$J$37),NA(),'S8'!$J$37)","v":{"$error":"#N/A"}}]
[{"$f":"IF(ISBLANK('S8'!K$26),\" \",'S8'!K$26)","v":" "},{"$f":"IF(ISTEXT('S8'!$L$32),NA(),'S8'!$L$32)","v":{"$error":"#N/A"}},null,{"$f":"IF(ISTEXT('S8'!$L$34),NA(),'S8'!$L$34)","v":{"$error":"#N/A"}},null,{"$f":"IF(ISTEXT('S8'!$L$35),NA(),'S8'!$L$35)","v":{"$error":"#N/A"}},null,{"$f":"IF(ISTEXT('S8'!$L$36),NA(),'S8'!$L$36)","v":{"$error":"#N/A"}},null,{"$f":"IF(ISTEXT('S8'!$L$37),NA(),'S8'!$L$37)","v":{"$error":"#N/A"}}]
[{"$f":"IF(ISBLANK('S8'!M$26),\" \",'S8'!M$26)","v":" "},{"$f":"IF(ISTEXT('S8'!$N$32),NA(),'S8'!$N$32)","v":{"$error":"#N/A"}},null,{"$f":"IF(ISTEXT('S8'!$N$34),NA(),'S8'!$N$34)","v":{"$error":"#N/A"}},null,{"$f":"IF(ISTEXT('S8'!$N$35),NA(),'S8'!$N$35)","v":{"$error":"#N/A"}},null,{"$f":"IF(ISTEXT('S8'!$N$36),NA(),'S8'!$N$36)","v":{"$error":"#N/A"}},null,{"$f":"IF(ISTEXT('S8'!$N$37),NA(),'S8'!$N$37)","v":{"$error":"#N/A"}}]
[{"$f":"IF(ISBLANK('S9'!C$8),\" \",'S9'!C$8)","v":" "},{"$f":"IF(ISTEXT('S9'!$D$14),NA(),'S9'!$D$14)","v":{"$error":"#N/A"}},null,{"$f":"IF(ISTEXT('S9'!$D$16),NA(),'S9'!$D$16)","v":{"$error":"#N/A"}},null,{"$f":"IF(ISTEXT('S9'!$D$17),NA(),'S9'!$D$17)","v":{"$error":"#N/A"}},null,{"$f":"IF(ISTEXT('S9'!$D$18),NA(),'S9'!$D$18)","v":{"$error":"#N/A"}},null,{"$f":"IF(ISTEXT('S9'!$D$19),NA(),'S9'!$D$19)","v":{"$error":"#N/A"}}]
[{"$f":"IF(ISBLANK('S9'!E$8),\" \",'S9'!E$8)","v":" "},{"$f":"IF(ISTEXT('S9'!$F$14),NA(),'S9'!$F$14)","v":{"$error":"#N/A"}},null,{"$f":"IF(ISTEXT('S9'!$F$16),NA(),'S9'!$F$16)","v":{"$error":"#N/A"}},null,{"$f":"IF(ISTEXT('S9'!$F$17),NA(),'S9'!$F$17)","v":{"$error":"#N/A"}},null,{"$f":"IF(ISTEXT('S9'!$F$18),NA(),'S9'!$F$18)","v":{"$error":"#N/A"}},null,{"$f":"IF(ISTEXT('S9'!$F$19),NA(),'S9'!$F$19)","v":{"$error":"#N/A"}}]
[{"$f":"IF(ISBLANK('S9'!G$8),\" \",'S9'!G$8)","v":" "},{"$f":"IF(ISTEXT('S9'!$H$14),NA(),'S9'!$H$14)","v":{"$error":"#N/A"}},null,{"$f":"IF(ISTEXT('S9'!$H$16),NA(),'S9'!$H$16)","v":{"$error":"#N/A"}},null,{"$f":"IF(ISTEXT('S9'!$H$17),NA(),'S9'!$H$17)","v":{"$error":"#N/A"}},null,{"$f":"IF(ISTEXT('S9'!$H$18),NA(),'S9'!$H$18)","v":{"$error":"#N/A"}},null,{"$f":"IF(ISTEXT('S9'!$H$19),NA(),'S9'!$H$19)","v":{"$error":"#N/A"}}]
[{"$f":"IF(ISBLANK('S9'!I$8),\" \",'S9'!I$8)","v":" "},{"$f":"IF(ISTEXT('S9'!$J$14),NA(),'S9'!$J$14)","v":{"$error":"#N/A"}},null,{"$f":"IF(ISTEXT('S9'!$J$16),NA(),'S9'!$J$16)","v":{"$error":"#N/A"}},null,{"$f":"IF(ISTEXT('S9'!$J$17),NA(),'S9'!$J$17)","v":{"$error":"#N/A"}},null,{"$f":"IF(ISTEXT('S9'!$J$18),NA(),'S9'!$J$18)","v":{"$error":"#N/A"}},null,{"$f":"IF(ISTEXT('S9'!$J$19),NA(),'S9'!$J$19)","v":{"$error":"#N/A"}}]
[{"$f":"IF(ISBLANK('S9'!K$8),\" \",'S9'!K$8)","v":" "},{"$f":"IF(ISTEXT('S9'!$L$14),NA(),'S9'!$L$14)","v":{"$error":"#N/A"}},null,{"$f":"IF(ISTEXT('S9'!$L$16),NA(),'S9'!$L$16)","v":{"$error":"#N/A"}},null,{"$f":"IF(ISTEXT('S9'!$L$17),NA(),'S9'!$L$17)","v":{"$error":"#N/A"}},null,{"$f":"IF(ISTEXT('S9'!$L$18),NA(),'S9'!$L$18)","v":{"$error":"#N/A"}},null,{"$f":"IF(ISTEXT('S9'!$L$19),NA(),'S9'!$L$19)","v":{"$error":"#N/A"}}]
[{"$f":"IF(ISBLANK('S9'!M$8),\" \",'S9'!M$8)","v":" "},{"$f":"IF(ISTEXT('S9'!$N$14),NA(),'S9'!$N$14)","v":{"$error":"#N/A"}},null,{"$f":"IF(ISTEXT('S9'!$N$16),NA(),'S9'!$N$16)","v":{"$error":"#N/A"}},null,{"$f":"IF(ISTEXT('S9'!$N$17),NA(),'S9'!$N$17)","v":{"$error":"#N/A"}},null,{"$f":"IF(ISTEXT('S9'!$N$18),NA(),'S9'!$N$18)","v":{"$error":"#N/A"}},null,{"$f":"IF(ISTEXT('S9'!$N$19),NA(),'S9'!$N$19)","v":{"$error":"#N/A"}}]
[{"$f":"IF(ISBLANK('S9'!C$26),\" \",'S9'!C$26)","v":" "},{"$f":"IF(ISTEXT('S9'!$D$32),NA(),'S9'!$D$32)","v":{"$error":"#N/A"}},null,{"$f":"IF(ISTEXT('S9'!$D$34),NA(),'S9'!$D$34)","v":{"$error":"#N/A"}},null,{"$f":"IF(ISTEXT('S9'!$D$35),NA(),'S9'!$D$35)","v":{"$error":"#N/A"}},null,{"$f":"IF(ISTEXT('S9'!$D$36),NA(),'S9'!$D$36)","v":{"$error":"#N/A"}},null,{"$f":"IF(ISTEXT('S9'!$D$37),NA(),'S9'!$D$37)","v":{"$error":"#N/A"}}]
[{"$f":"IF(ISBLANK('S9'!E$26),\" \",'S9'!E$26)","v":" "},{"$f":"IF(ISTEXT('S9'!$F$32),NA(),'S9'!$F$32)","v":{"$error":"#N/A"}},null,{"$f":"IF(ISTEXT('S9'!$F$34),NA(),'S9'!$F$34)","v":{"$error":"#N/A"}},null,{"$f":"IF(ISTEXT('S9'!$F$35),NA(),'S9'!$F$35)","v":{"$error":"#N/A"}},null,{"$f":"IF(ISTEXT('S9'!$F$36),NA(),'S9'!$F$36)","v":{"$error":"#N/A"}},null,{"$f":"IF(ISTEXT('S9'!$F$37),NA(),'S9'!$F$37)","v":{"$error":"#N/A"}}]
[{"$f":"IF(ISBLANK('S9'!G$26),\" \",'S9'!G$26)","v":" "},{"$f":"IF(ISTEXT('S9'!$H$32),NA(),'S9'!$H$32)","v":{"$error":"#N/A"}},null,{"$f":"IF(ISTEXT('S9'!$H$34),NA(),'S9'!$H$34)","v":{"$error":"#N/A"}},null,{"$f":"IF(ISTEXT('S9'!$H$35),NA(),'S9'!$H$35)","v":{"$error":"#N/A"}},null,{"$f":"IF(ISTEXT('S9'!$H$36),NA(),'S9'!$H$36)","v":{"$error":"#N/A"}},null,{"$f":"IF(ISTEXT('S9'!$H$37),NA(),'S9'!$H$37)","v":{"$error":"#N/A"}}]
[{"$f":"IF(ISBLANK('S9'!I$26),\" \",'S9'!I$26)","v":" "},{"$f":"IF(ISTEXT('S9'!$J$32),NA(),'S9'!$J$32)","v":{"$error":"#N/A"}},null,{"$f":"IF(ISTEXT('S9'!$J$34),NA(),'S9'!$J$34)","v":{"$error":"#N/A"}},null,{"$f":"IF(ISTEXT('S9'!$J$35),NA(),'S9'!$J$35)","v":{"$error":"#N/A"}},null,{"$f":"IF(ISTEXT('S9'!$J$36),NA(),'S9'!$J$36)","v":{"$error":"#N/A"}},null,{"$f":"IF(ISTEXT('S9'!$J$37),NA(),'S9'!$J$37)","v":{"$error":"#N/A"}}]
[{"$f":"IF(ISBLANK('S9'!K$26),\" \",'S9'!K$26)","v":" "},{"$f":"IF(ISTEXT('S9'!$L$32),NA(),'S9'!$L$32)","v":{"$error":"#N/A"}},null,{"$f":"IF(ISTEXT('S9'!$L$34),NA(),'S9'!$L$34)","v":{"$error":"#N/A"}},null,{"$f":"IF(ISTEXT('S9'!$L$35),NA(),'S9'!$L$35)","v":{"$error":"#N/A"}},null,{"$f":"IF(ISTEXT('S9'!$L$36),NA(),'S9'!$L$36)","v":{"$error":"#N/A"}},null,{"$f":"IF(ISTEXT('S9'!$L$37),NA(),'S9'!$L$37)","v":{"$error":"#N/A"}}]
[{"$f":"IF(ISBLANK('S9'!M$26),\" \",'S9'!M$26)","v":" "},{"$f":"IF(ISTEXT('S9'!$N$32),NA(),'S9'!$N$32)","v":{"$error":"#N/A"}},null,{"$f":"IF(ISTEXT('S9'!$N$34),NA(),'S9'!$N$34)","v":{"$error":"#N/A"}},null,{"$f":"IF(ISTEXT('S9'!$N$35),NA(),'S9'!$N$35)","v":{"$error":"#N/A"}},null,{"$f":"IF(ISTEXT('S9'!$N$36),NA(),'S9'!$N$36)","v":{"$error":"#N/A"}},null,{"$f":"IF(ISTEXT('S9'!$N$37),NA(),'S9'!$N$37)","v":{"$error":"#N/A"}}]
[{"$f":"IF(ISBLANK('S10'!C$8),\" \",'S10'!C$8)","v":" "},{"$f":"IF(ISTEXT('S10'!$D$14),NA(),'S10'!$D$14)","v":{"$error":"#N/A"}},null,{"$f":"IF(ISTEXT('S10'!$D$16),NA(),'S10'!$D$16)","v":{"$error":"#N/A"}},null,{"$f":"IF(ISTEXT('S10'!$D$17),NA(),'S10'!$D$17)","v":{"$error":"#N/A"}},null,{"$f":"IF(ISTEXT('S10'!$D$18),NA(),'S10'!$D$18)","v":{"$error":"#N/A"}},null,{"$f":"IF(ISTEXT('S10'!$D$19),NA(),'S10'!$D$19)","v":{"$error":"#N/A"}}]
[{"$f":"IF(ISBLANK('S10'!E$8),\" \",'S10'!E$8)","v":" "},{"$f":"IF(ISTEXT('S10'!$F$14),NA(),'S10'!$F$14)","v":{"$error":"#N/A"}},null,{"$f":"IF(ISTEXT('S10'!$F$16),NA(),'S10'!$F$16)","v":{"$error":"#N/A"}},null,{"$f":"IF(ISTEXT('S10'!$F$17),NA(),'S10'!$F$17)","v":{"$error":"#N/A"}},null,{"$f":"IF(ISTEXT('S10'!$F$18),NA(),'S10'!$F$18)","v":{"$error":"#N/A"}},null,{"$f":"IF(ISTEXT('S10'!$F$19),NA(),'S10'!$F$19)","v":{"$error":"#N/A"}}]
[{"$f":"IF(ISBLANK('S10'!G$8),\" \",'S10'!G$8)","v":" "},{"$f":"IF(ISTEXT('S10'!$H$14),NA(),'S10'!$H$14)","v":{"$error":"#N/A"}},null,{"$f":"IF(ISTEXT('S10'!$H$16),NA(),'S10'!$H$16)","v":{"$error":"#N/A"}},null,{"$f":"IF(ISTEXT('S10'!$H$17),NA(),'S10'!$H$17)","v":{"$error":"#N/A"}},null,{"$f":"IF(ISTEXT('S10'!$H$18),NA(),'S10'!$H$18)","v":{"$error":"#N/A"}},null,{"$f":"IF(ISTEXT('S10'!$H$19),NA(),'S10'!$H$19)","v":{"$error":"#N/A"}}]
[{"$f":"IF(ISBLANK('S10'!I$8),\" \",'S10'!I$8)","v":" "},{"$f":"IF(ISTEXT('S10'!$J$14),NA(),'S10'!$J$14)","v":{"$error":"#N/A"}},null,{"$f":"IF(ISTEXT('S10'!$J$16),NA(),'S10'!$J$16)","v":{"$error":"#N/A"}},null,{"$f":"IF(ISTEXT('S10'!$J$17),NA(),'S10'!$J$17)","v":{"$error":"#N/A"}},null,{"$f":"IF(ISTEXT('S10'!$J$18),NA(),'S10'!$J$18)","v":{"$error":"#N/A"}},null,{"$f":"IF(ISTEXT('S10'!$J$19),NA(),'S10'!$J$19)","v":{"$error":"#N/A"}}]
[{"$f":"IF(ISBLANK('S10'!K$8),\" \",'S10'!K$8)","v":" "},{"$f":"IF(ISTEXT('S10'!$L$14),NA(),'S10'!$L$14)","v":{"$error":"#N/A"}},null,{"$f":"IF(ISTEXT('S10'!$L$16),NA(),'S10'!$L$16)","v":{"$error":"#N/A"}},null,{"$f":"IF(ISTEXT('S10'!$L$17),NA(),'S10'!$L$17)","v":{"$error":"#N/A"}},null,{"$f":"IF(ISTEXT('S10'!$L$18),NA(),'S10'!$L$18)","v":{"$error":"#N/A"}},null,{"$f":"IF(ISTEXT('S10'!$L$19),NA(),'S10'!$L$19)","v":{"$error":"#N/A"}}]
[{"$f":"IF(ISBLANK('S10'!M$8),\" \",'S10'!M$8)","v":" "},{"$f":"IF(ISTEXT('S10'!$N$14),NA(),'S10'!$N$14)","v":{"$error":"#N/A"}},null,{"$f":"IF(ISTEXT('S10'!$N$16),NA(),'S10'!$N$16)","v":{"$error":"#N/A"}},null,{"$f":"IF(ISTEXT('S10'!$N$17),NA(),'S10'!$N$17)","v":{"$error":"#N/A"}},null,{"$f":"IF(ISTEXT('S10'!$N$18),NA(),'S10'!$N$18)","v":{"$error":"#N/A"}},null,{"$f":"IF(ISTEXT('S10'!$N$19),NA(),'S10'!$N$19)","v":{"$error":"#N/A"}}]
[{"$f":"IF(ISBLANK('S10'!C$26),\" \",'S10'!C$26)","v":" "},{"$f":"IF(ISTEXT('S10'!$D$32),NA(),'S10'!$D$32)","v":{"$error":"#N/A"}},null,{"$f":"IF(ISTEXT('S10'!$D$34),NA(),'S10'!$D$34)","v":{"$error":"#N/A"}},null,{"$f":"IF(ISTEXT('S10'!$D$35),NA(),'S10'!$D$35)","v":{"$error":"#N/A"}},null,{"$f":"IF(ISTEXT('S10'!$D$36),NA(),'S10'!$D$36)","v":{"$error":"#N/A"}},null,{"$f":"IF(ISTEXT('S10'!$D$37),NA(),'S10'!$D$37)","v":{"$error":"#N/A"}}]
[{"$f":"IF(ISBLANK('S10'!E$26),\" \",'S10'!E$26)","v":" "},{"$f":"IF(ISTEXT('S10'!$F$32),NA(),'S10'!$F$32)","v":{"$error":"#N/A"}},null,{"$f":"IF(ISTEXT('S10'!$F$34),NA(),'S10'!$F$34)","v":{"$error":"#N/A"}},null,{"$f":"IF(ISTEXT('S10'!$F$35),NA(),'S10'!$F$35)","v":{"$error":"#N/A"}},null,{"$f":"IF(ISTEXT('S10'!$F$36),NA(),'S10'!$F$36)","v":{"$error":"#N/A"}},null,{"$f":"IF(ISTEXT('S10'!$F$37),NA(),'S10'!$F$37)","v":{"$error":"#N/A"}}]
[{"$f":"IF(ISBLANK('S10'!G$26),\" \",'S10'!G$26)","v":" "},{"$f":"IF(ISTEXT('S10'!$H$32),NA(),'S10'!$H$32)","v":{"$error":"#N/A"}},null,{"$f":"IF(ISTEXT('S10'!$H$34),NA(),'S10'!$H$34)","v":{"$error":"#N/A"}},null,{"$f":"IF(ISTEXT('S10'!$H$35),NA(),'S10'!$H$35)","v":{"$error":"#N/A"}},null,{"$f":"IF(ISTEXT('S10'!$H$36),NA(),'S10'!$H$36)","v":{"$error":"#N/A"}},null,{"$f":"IF(ISTEXT('S10'!$H$37),NA(),'S10'!$H$37)","v":{"$error":"#N/A"}}]
[{"$f":"IF(ISBLANK('S10'!I$26),\" \",'S10'!I$26)","v":" "},{"$f":"IF(ISTEXT('S10'!$J$32),NA(),'S10'!$J$32)","v":{"$error":"#N/A"}},null,{"$f":"IF(ISTEXT('S10'!$J$34),NA(),'S10'!$J$34)","v":{"$error":"#N/A"}},null,{"$f":"IF(ISTEXT('S10'!$J$35),NA(),'S10'!$J$35)","v":{"$error":"#N/A"}},null,{"$f":"IF(ISTEXT('S10'!$J$36),NA(),'S10'!$J$36)","v":{"$error":"#N/A"}},null,{"$f":"IF(ISTEXT('S10'!$J$37),NA(),'S10'!$J$37)","v":{"$error":"#N/A"}}]
[{"$f":"IF(ISBLANK('S10'!K$26),\" \",'S10'!K$26)","v":" "},{"$f":"IF(ISTEXT('S10'!$L$32),NA(),'S10'!$L$32)","v":{"$error":"#N/A"}},null,{"$f":"IF(ISTEXT('S10'!$L$34),NA(),'S10'!$L$34)","v":{"$error":"#N/A"}},null,{"$f":"IF(ISTEXT('S10'!$L$35),NA(),'S10'!$L$35)","v":{"$error":"#N/A"}},null,{"$f":"IF(ISTEXT('S10'!$L$36),NA(),'S10'!$L$36)","v":{"$error":"#N/A"}},null,{"$f":"IF(ISTEXT('S10'!$L$37),NA(),'S10'!$L$37)","v":{"$error":"#N/A"}}]
[{"$f":"IF(ISBLANK('S10'!M$26),\" \",'S10'!M$26)","v":" "},{"$f":"IF(ISTEXT('S10'!$N$32),NA(),'S10'!$N$32)","v":{"$error":"#N/A"}},null,{"$f":"IF(ISTEXT('S10'!$N$34),NA(),'S10'!$N$34)","v":{"$error":"#N/A"}},null,{"$f":"IF(ISTEXT('S10'!$N$35),NA(),'S10'!$N$35)","v":{"$error":"#N/A"}},null,{"$f":"IF(ISTEXT('S10'!$N$36),NA(),'S10'!$N$36)","v":{"$error":"#N/A"}},null,{"$f":"IF(ISTEXT('S10'!$N$37),NA(),'S10'!$N$37)","v":{"$error":"#N/A"}}]

{"sheet":"AP","index":18,"n_rows":23,"n_cols":14,"rows_kept":23,"cut":false,"hidden":true,"merged":[[16,7,18,7],[20,7,22,7],[4,7,6,7],[8,7,10,7],[12,7,14,7]]}
[]
[null,null,null,null,null,null,null,null,null,{"$f":"'S1'!L4","v":"Type 3B"}]
[]
[]
[null,null,null,null,null,null,null,0.375,"Max",105]
[]
[null,null,null,null,null,null,null,null,"Min",95]
[]
[null,null,null,null,null,null,null,4,"Max",{"$f":"IF($J$2=\"Type 3B\",100,IF($J$2=\"AS1\",100,IF($J$2=\"Type 6S\",85,IF($J$2=\"AS2\",80))))","v":100}]
[]
[null,null,null,null,null,null,null,null,"Min",{"$f":"IF($J$2=\"Type 3B\",85,IF($J$2=\"AS1\",60,IF($J$2=\"Type 6S\",35,IF($J$2=\"AS2\",35))))","v":85}]
[]
[null,null,null,null,null,null,null,8,"Max",{"$f":"IF($J$2=\"Type 3B\",55,IF($J$2=\"AS1\",55,IF($J$2=\"Type 6S\",55,IF($J$2=\"AS2\",45))))","v":55}]
[]
[null,null,null,null,null,null,null,null,"Min",0]
[]
[null,null,null,null,null,null,null,100,"Max",{"$f":"IF($J$2=\"Type 3B\",5,IF($J$2=\"AS1\",8,IF($J$2=\"Type 6S\",8,IF($J$2=\"AS2\",6))))","v":5}]
[]
[null,null,null,null,null,null,null,null,"Min",0]
[null,null,null,null,null,null,null,null,null,null,null,null,null,"`"]
[null,null,null,null,null,null,null,200,"Max",{"$f":"IF($J$2=\"Type 3B\",4,IF($J$2=\"AS1\",5,IF($J$2=\"Type 6S\",5,IF($J$2=\"AS2\",3))))","v":4}]
[]
[null,null,null,null,null,null,null,null,"Min",0]